"molecule_id","AMW","C.","H.","Me","Mi","Mp","Mv","MW","N.","nAB","nAT","nB","nBM","nBO","nBR","nBT","nC","nCL","nCsp","nCsp2","nCsp3","nDB","nF","nH","nHet","nHM","nI","nN","nO","nP","nS","nSK","nTB","nX","O.","RBF","RBN","SCBO","Se","Si","Sp","Sv","X.","pXC50"
{1 7.578,2 35.8,3 49.3,4 1.005,5 1.129,6 0.657,7 0.611,8 507.74,9 4.5,10 11,11 67,13 15,14 36,16 69,17 24,20 12,21 12,22 4,24 33,25 10,26 2,28 3,29 5,31 2,32 34,35 7.5,36 0.159,37 11,38 45.5,39 67.349,40 75.61,41 44.006,42 40.914,44 7.783}
{0 CHEMBL1164104,1 7.636,2 36.1,3 48.6,4 1.008,5 1.128,6 0.656,7 0.613,8 549.78,9 4.2,10 11,11 72,13 16,14 39,16 74,17 26,20 13,21 13,22 5,24 35,25 11,26 2,28 3,29 6,31 2,32 37,35 8.3,36 0.149,37 11,38 49.5,39 72.56,40 81.235,41 47.222,42 44.156,44 8.444}
{0 CHEMBL1164105,1 7.995,2 38.1,3 46,4 1.009,5 1.123,6 0.674,7 0.633,8 503.7,9 4.8,10 11,11 63,13 17,14 36,16 65,17 24,20 15,21 9,22 6,24 29,25 10,26 2,28 3,29 5,31 2,32 34,35 7.9,36 0.169,37 11,38 47.5,39 63.582,40 70.78,41 42.483,42 39.861,44 6.967}
{0 CHEMBL1164112,1 7.762,2 35.9,3 50,4 1,5 1.122,6 0.675,7 0.615,8 496.78,9 3.1,10 11,11 64,13 14,14 34,16 66,17 23,20 11,21 12,22 3,24 32,25 9,26 3,28 2,29 4,31 3,32 32,35 6.3,36 0.167,37 11,38 42.5,39 63.996,40 71.822,41 43.193,42 39.365,44 6.553}
{0 CHEMBL1164113,1 8.212,2 38.3,3 46.7,4 1.004,5 1.117,6 0.695,7 0.639,8 492.74,9 3.3,10 16,11 60,13 19,14 34,16 62,17 23,20 14,21 9,22 3,24 28,25 9,26 3,28 2,29 4,31 3,32 32,35 6.7,36 0.177,37 11,38 45,39 60.229,40 66.992,41 41.671,42 38.312,44 8.495}
{0 CHEMBL1164270,1 7.652,2 37.5,3 48.4,4 1.002,5 1.125,6 0.669,7 0.62,8 489.72,9 4.7,10 16,11 64,13 19,14 35,16 66,17 24,20 14,21 10,22 3,24 31,25 9,26 2,28 3,29 4,31 2,32 33,35 6.3,36 0.167,37 11,38 46,39 64.138,40 71.985,41 42.79,42 39.673,44 7.754}
{0 CHEMBL1164322,1 8.061,2 39.3,3 47.5,4 1,5 1.113,6 0.696,7 0.636,8 491.75,9 1.6,10 16,11 61,13 19,14 34,16 63,17 24,20 15,21 9,22 3,24 29,25 8,26 3,28 1,29 4,31 3,32 32,35 6.6,36 0.175,37 11,38 45,39 61.011,40 67.909,41 42.426,42 38.817,44 6.757}
{0 CHEMBL1164415,1 8.096,2 35.6,3 45.8,4 1.012,5 1.131,6 0.67,7 0.629,8 477.67,9 8.5,10 16,11 59,13 19,14 34,16 61,17 21,20 12,21 9,22 3,24 27,25 11,26 2,28 5,29 4,31 2,32 32,35 6.8,36 0.18,37 11,38 45,39 59.691,40 66.736,41 39.517,42 37.135,44 7.31}
{0 CHEMBL1164531,1 7.944,2 38.3,3 46.7,4 1.008,5 1.121,6 0.675,7 0.631,8 476.67,9 3.3,10 16,11 60,13 19,14 34,16 62,17 23,20 14,21 9,22 3,24 28,25 9,26 2,28 2,29 5,31 2,32 32,35 8.3,36 0.177,37 11,38 45,39 60.48,40 67.281,41 40.477,42 37.839,44 8.409}
{0 CHEMBL1164532,1 8.801,2 37.1,3 41.9,4 1.034,5 1.142,6 0.666,7 0.645,8 545.66,9 4.8,10 16,11 62,13 19,14 38,16 64,17 23,20 13,21 10,22 3,23 3,24 26,25 13,26 2,28 3,29 5,31 2,32 36,34 3,35 8.1,36 0.172,37 11,38 49,39 64.12,40 70.799,41 41.296,42 40.011,43 4.8,44 6.484}
{0 CHEMBL1164533,1 8.588,2 39,3 44.1,4 1.011,5 1.115,6 0.701,7 0.653,8 506.72,9 3.4,10 16,11 59,13 20,14 35,16 61,17 23,20 15,21 8,22 4,24 26,25 10,26 3,28 2,29 5,31 3,32 33,35 8.5,36 0.18,37 11,38 47,39 59.673,40 65.786,41 41.364,42 38.5,44 7.73}
{0 CHEMBL1164560,1 7.798,2 37.7,3 47.5,4 1.004,5 1.124,6 0.673,7 0.625,8 475.69,9 4.9,10 16,11 61,13 19,14 34,16 63,17 23,20 14,21 9,22 3,24 29,25 9,26 2,28 3,29 4,31 2,32 32,35 6.6,36 0.175,37 11,38 45,39 61.254,40 68.57,41 41.029,42 38.146,44 8.638}
{0 CHEMBL1164561,1 8.495,2 37.5,3 43.8,4 1.026,5 1.141,6 0.666,7 0.638,8 543.69,9 4.7,10 16,11 64,13 19,14 38,16 66,17 24,20 14,21 10,22 3,23 3,24 28,25 12,26 2,28 3,29 4,31 2,32 36,34 3,35 6.3,36 0.167,37 11,38 49,39 65.676,40 73.004,41 42.603,42 40.823,43 4.7,44 8.022}
{0 CHEMBL1164869,1 8.096,2 35.6,3 45.8,4 1.012,5 1.131,6 0.67,7 0.629,8 477.67,9 8.5,10 16,11 59,13 19,14 34,16 61,17 21,20 12,21 9,22 3,24 27,25 11,26 2,28 5,29 4,31 2,32 32,35 6.8,36 0.18,37 11,38 45,39 59.691,40 66.736,41 39.517,42 37.135,44 7.796}
{0 CHEMBL1164870,1 7.58,2 36.9,3 49.2,4 1.004,5 1.125,6 0.662,7 0.614,8 492.72,9 3.1,10 11,11 65,13 15,14 35,16 67,17 24,20 12,21 12,22 4,24 32,25 9,26 2,28 2,29 5,31 2,32 33,35 7.7,36 0.164,37 11,38 44.5,39 65.247,40 73.112,41 43,42 39.893,44 8.456}
{0 CHEMBL1164871,1 7.917,2 37.5,3 46.9,4 1.011,5 1.124,6 0.667,7 0.626,8 506.7,9 3.1,10 11,11 64,13 16,14 36,16 66,17 24,20 13,21 11,22 5,24 30,25 10,26 2,28 2,29 6,31 2,32 34,35 9.4,36 0.167,37 11,38 46.5,39 64.691,40 71.906,41 42.693,42 40.081,44 5}
{0 CHEMBL1165175,1 7.995,2 38.1,3 46,4 1.009,5 1.123,6 0.674,7 0.633,8 503.7,9 4.8,10 16,11 63,13 20,14 36,16 65,17 24,20 15,21 9,22 4,24 29,25 10,26 2,28 3,29 5,31 2,32 34,35 7.9,36 0.169,37 11,38 48,39 63.582,40 70.78,41 42.483,42 39.861,44 8.538}
{0 CHEMBL1165260,1 8.316,2 39,3 44.1,4 1.016,5 1.12,6 0.681,7 0.645,8 490.65,9 3.4,10 16,11 59,13 20,14 35,16 61,17 23,20 15,21 8,22 4,24 26,25 10,26 2,28 2,29 6,31 2,32 33,35 10.2,36 0.18,37 11,38 47,39 59.923,40 66.075,41 40.171,42 38.027,44 7.86}
{0 CHEMBL1165261,1 7.995,2 38.1,3 46,4 1.009,5 1.123,6 0.674,7 0.633,8 503.7,9 4.8,10 16,11 63,13 20,14 36,16 65,17 24,20 15,21 9,22 4,24 29,25 10,26 2,28 3,29 5,31 2,32 34,35 7.9,36 0.169,37 11,38 48,39 63.582,40 70.78,41 42.483,42 39.861,44 8.469}
{0 CHEMBL1165496,1 7.905,2 36.4,3 47,4 1.012,5 1.127,6 0.662,7 0.623,8 521.72,9 4.5,10 11,11 66,13 16,14 37,16 68,17 24,20 13,21 11,22 5,24 31,25 11,26 2,28 3,29 6,31 2,32 35,35 9.1,36 0.162,37 11,38 47.5,39 66.792,40 74.404,41 43.699,42 41.102,44 7.164}
{0 CHEMBL1165505,1 8.495,2 37.5,3 43.8,4 1.026,5 1.141,6 0.666,7 0.638,8 543.69,9 4.7,10 16,11 64,13 19,14 38,16 66,17 24,20 14,21 10,22 3,23 3,24 28,25 12,26 2,28 3,29 4,31 2,32 36,34 3,35 6.3,36 0.167,37 11,38 49,39 65.676,40 73.004,41 42.603,42 40.823,43 4.7,44 8.137}
{0 CHEMBL1165554,1 7.384,2 35.8,3 50.7,4 1.002,5 1.127,6 0.653,7 0.603,8 494.74,9 3,10 11,11 67,13 14,14 35,16 69,17 24,20 11,21 13,22 3,24 34,25 9,26 2,28 2,29 5,31 2,32 33,35 7.5,36 0.159,37 11,38 43.5,39 67.131,40 75.527,41 43.762,42 40.42,44 6.553}
{0 CHEMBL1165729,1 7.452,2 36.8,3 50,4 1.002,5 1.125,6 0.658,7 0.609,8 506.75,9 2.9,10 11,11 68,13 15,14 36,16 70,17 25,20 12,21 13,22 4,24 34,25 9,26 2,28 2,29 5,31 2,32 34,35 7.4,36 0.157,37 11,38 45.5,39 68.131,40 76.527,41 44.762,42 41.42,44 7.793}
{0 CHEMBL1165759,1 8.429,2 40,3 45,4 1.008,5 1.112,6 0.702,7 0.65,8 505.73,9 1.7,10 16,11 60,13 20,14 35,16 62,17 24,20 16,21 8,22 4,24 27,25 9,26 3,28 1,29 5,31 3,32 33,35 8.3,36 0.177,37 11,38 47,39 60.454,40 66.703,41 42.119,42 39.005,44 7.726}
{0 CHEMBL157946,1 7.267,2 44.3,3 45.7,4 0.997,5 1.12,6 0.672,7 0.637,8 508.67,9 5.7,10 23,11 70,13 25,14 42,16 74,17 31,20 23,21 8,22 2,24 32,25 7,28 4,29 3,32 38,35 4.3,36 0.095,37 7,38 55.5,39 69.76,40 78.434,41 47.046,42 44.605,44 7.469}
{0 CHEMBL189568,1 7.798,2 37.7,3 47.5,4 1.004,5 1.124,6 0.673,7 0.625,8 475.69,9 4.9,10 16,11 61,13 19,14 34,16 63,17 23,20 14,21 9,22 3,24 29,25 9,26 2,28 3,29 4,31 2,32 32,35 6.6,36 0.175,37 11,38 45,39 61.254,40 68.57,41 41.029,42 38.146,44 9.398}
{0 CHEMBL191,1 7.98,2 41.5,3 43.4,4 1.004,5 1.13,6 0.683,7 0.649,8 422.96,9 11.3,10 22,11 53,13 22,14 33,16 56,17 22,18 1,20 16,21 6,24 23,25 8,26 1,28 6,29 1,32 30,34 1,35 1.9,36 0.143,37 8,38 44,39 53.214,40 59.88,41 36.199,42 34.412,43 1.9,44 5}
