"molecule_id","AMW","C.","H.","Me","Mi","Mp","Mv","MW","N.","nAB","nAT","nB","nBM","nBO","nBR","nBT","nC","nCL","nCsp","nCsp2","nCsp3","nDB","nF","nH","nHet","nHM","nI","nN","nO","nP","nS","nSK","nTB","nX","O.","RBF","RBN","SCBO","Se","Si","Sp","Sv","X.","pXC50"
{1 7.793,2 37.8,3 43.2,4 1.019,5 1.138,6 0.647,7 0.632,8 288.34,9 10.8,10 6,11 37,13 9,14 23,16 39,17 14,20 10,21 4,22 3,24 16,25 7,28 4,29 3,32 21,35 8.1,36 0.103,37 4,38 29,39 37.691,40 42.113,41 23.955,42 23.391,44 5.301}
{0 CHEMBL1802355,1 8.434,2 45,3 37.5,4 1.023,5 1.121,6 0.685,7 0.677,8 337.36,9 7.5,10 12,11 40,13 15,14 28,16 43,17 18,20 16,21 2,22 3,24 15,25 7,28 3,29 4,32 25,35 10,36 0.093,37 4,38 37,39 40.916,40 44.824,41 27.404,42 27.084,44 5}
{0 CHEMBL1802356,1 9.009,2 46.2,3 33.3,4 1.035,5 1.118,6 0.695,7 0.699,8 351.34,9 7.7,10 12,11 39,13 15,14 30,16 43,17 18,20 16,21 2,22 3,24 13,25 8,28 3,29 5,32 26,35 12.8,36 0.07,37 3,38 39,39 40.36,40 43.618,41 27.097,42 27.272,44 6.444}
{0 CHEMBL1802357,1 8.699,2 45.2,3 35.7,4 1.03,5 1.12,6 0.687,7 0.686,8 365.37,9 7.1,10 12,11 42,13 15,14 31,16 46,17 19,20 16,21 3,22 3,24 15,25 8,28 3,29 5,32 27,35 11.9,36 0.065,37 3,38 40,39 43.244,40 47.033,41 28.858,42 28.799,44 5}
{0 CHEMBL1802358,1 8.537,2 47.2,3 36.1,4 1.02,5 1.117,6 0.7,7 0.69,8 307.33,9 8.3,10 12,11 36,13 15,14 26,16 39,17 17,20 16,21 1,22 3,24 13,25 6,28 3,29 3,32 23,35 8.3,36 0.077,37 3,38 35,39 36.705,40 40.199,41 25.188,42 24.843,44 5}
{0 CHEMBL1802841,1 8.103,2 40.6,3 40.6,4 1.022,5 1.131,6 0.662,7 0.651,8 259.29,9 9.4,10 6,11 32,13 9,14 21,16 34,17 13,20 10,21 3,22 3,24 13,25 6,28 3,29 3,32 19,35 9.4,36 0.059,37 2,38 27,39 32.705,40 36.199,41 21.188,42 20.843,44 5.495}
{0 CHEMBL1802842,1 7.809,2 40,3 42.9,4 1.017,5 1.132,6 0.656,7 0.639,8 273.32,9 8.6,10 6,11 35,13 9,14 22,16 37,17 14,20 10,21 4,22 3,24 15,25 6,28 3,29 3,32 20,35 8.6,36 0.081,37 3,38 28,39 35.589,40 39.614,41 22.949,42 22.369,44 5.678}
{0 CHEMBL1802843,1 7.562,2 39.5,3 44.7,4 1.012,5 1.132,6 0.65,7 0.629,8 287.35,9 7.9,10 6,11 38,13 9,14 23,16 40,17 15,20 10,21 5,22 3,24 17,25 6,28 3,29 3,32 21,35 7.9,36 0.1,37 4,38 29,39 38.473,40 43.03,41 24.71,42 23.896,44 5.921}
{0 CHEMBL1802844,1 7.562,2 39.5,3 44.7,4 1.012,5 1.132,6 0.65,7 0.629,8 287.35,9 7.9,10 6,11 38,13 9,14 23,16 40,17 15,20 10,21 5,22 3,24 17,25 6,28 3,29 3,32 21,35 7.9,36 0.075,37 3,38 29,39 38.473,40 43.03,41 24.71,42 23.896,44 5.699}
{0 CHEMBL1802845,1 7.351,2 39,3 46.3,4 1.009,5 1.133,6 0.646,7 0.62,8 301.38,9 7.3,10 6,11 41,13 9,14 24,16 43,17 16,20 10,21 6,22 3,24 19,25 6,28 3,29 3,32 22,35 7.3,36 0.116,37 5,38 30,39 41.356,40 46.445,41 26.472,42 25.423,44 5.959}
{0 CHEMBL1802846,1 7.351,2 39,3 46.3,4 1.009,5 1.133,6 0.646,7 0.62,8 301.38,9 7.3,10 6,11 41,13 9,14 24,16 43,17 16,20 10,21 6,22 3,24 19,25 6,28 3,29 3,32 22,35 7.3,36 0.093,37 4,38 30,39 41.356,40 46.445,41 26.472,42 25.423,44 6.046}
{0 CHEMBL1802847,1 7.168,2 38.6,3 47.7,4 1.005,5 1.133,6 0.642,7 0.612,8 315.41,9 6.8,10 6,11 44,13 9,14 25,16 46,17 17,20 10,21 7,22 3,24 21,25 6,28 3,29 3,32 23,35 6.8,36 0.109,37 5,38 31,39 44.24,40 49.86,41 28.233,42 26.95,44 6.018}
{0 CHEMBL1802848,1 7.926,2 41.7,3 41.7,4 1.016,5 1.128,6 0.665,7 0.649,8 285.33,9 8.3,10 6,11 36,13 10,14 23,16 38,17 15,20 12,21 3,22 4,24 15,25 6,28 3,29 3,32 21,35 8.3,36 0.105,37 4,38 30,39 36.589,40 40.614,41 23.949,42 23.369,44 6.056}
{0 CHEMBL1802849,1 7.676,2 41,3 43.6,4 1.012,5 1.129,6 0.659,7 0.638,8 299.36,9 7.7,10 6,11 39,13 9,14 25,16 42,17 16,20 10,21 6,22 3,24 17,25 6,28 3,29 3,32 22,35 7.7,36 0.095,37 4,38 31,39 39.473,40 44.03,41 25.71,42 24.896,44 6.292}
{0 CHEMBL1802850,1 7.462,2 40.5,3 45.2,4 1.008,5 1.13,6 0.654,7 0.629,8 313.39,9 7.1,10 6,11 42,13 9,14 26,16 45,17 17,20 10,21 7,22 3,24 19,25 6,28 3,29 3,32 23,35 7.1,36 0.067,37 3,38 32,39 42.356,40 47.445,41 27.472,42 26.423,44 5}
{0 CHEMBL1802851,1 8.037,2 38.9,3 41.7,4 1.025,5 1.134,6 0.65,7 0.641,8 289.32,9 8.3,10 6,11 36,13 9,14 23,16 38,17 14,20 10,21 4,22 3,24 15,25 7,28 3,29 4,32 21,35 11.1,36 0.105,37 4,38 29,39 36.916,40 40.824,41 23.404,42 23.084,44 5}
{0 CHEMBL1802852,1 7.778,2 38.5,3 43.6,4 1.021,5 1.134,6 0.645,7 0.631,8 303.35,9 7.7,10 6,11 39,13 9,14 24,16 41,17 15,20 10,21 5,22 3,24 17,25 7,28 3,29 4,32 22,35 10.3,36 0.122,37 5,38 30,39 39.8,40 44.239,41 25.165,42 24.611,44 5.509}
{0 CHEMBL1802853,1 7.778,2 38.5,3 43.6,4 1.021,5 1.134,6 0.645,7 0.631,8 303.35,9 7.7,10 6,11 39,13 9,14 24,16 41,17 15,20 10,21 5,22 3,24 17,25 7,28 3,29 4,32 22,35 10.3,36 0.122,37 5,38 30,39 39.8,40 44.239,41 25.165,42 24.611,44 5.409}
{0 CHEMBL1802854,1 7.365,2 37.8,3 46.7,4 1.013,5 1.135,6 0.638,7 0.615,8 331.41,9 6.7,10 6,11 45,13 9,14 26,16 47,17 17,20 10,21 7,22 3,24 21,25 7,28 3,29 4,32 24,35 8.9,36 0.149,37 7,38 32,39 45.567,40 51.069,41 28.688,42 27.665,44 5.155}
{0 CHEMBL1802855,1 7.467,2 37.5,3 45.8,4 1.014,5 1.137,6 0.639,7 0.618,8 358.44,9 8.3,10 6,11 48,13 9,14 29,16 51,17 18,20 10,21 8,22 3,24 22,25 8,28 4,29 4,32 26,35 8.3,36 0.098,37 5,38 35,39 48.669,40 54.568,41 30.693,42 29.686,44 5.097}
{0 CHEMBL1802856,1 8.45,2 41.2,3 38.2,4 1.03,5 1.13,6 0.666,7 0.663,8 287.3,9 8.8,10 6,11 34,13 10,14 23,16 36,17 14,20 11,21 3,22 4,24 13,25 7,28 3,29 4,32 21,35 11.8,36 0.056,37 2,38 30,39 35.033,40 38.409,41 22.642,42 22.557,44 5}
{0 CHEMBL1802857,1 8.633,2 40,3 37.5,4 1.039,5 1.131,6 0.658,7 0.663,8 345.34,9 7.5,10 6,11 40,13 11,14 27,16 42,17 16,20 12,21 4,22 5,24 15,25 9,28 3,29 6,32 25,35 15,36 0.119,37 5,38 35,39 41.571,40 45.243,41 26.313,42 26.514,44 5}
{0 CHEMBL1803067,1 7.985,2 45.2,3 40.5,4 1.011,5 1.12,6 0.684,7 0.664,8 335.39,9 7.1,10 12,11 42,13 15,14 28,16 45,17 19,20 16,21 3,22 3,24 17,25 6,28 3,29 3,32 25,35 7.1,36 0.089,37 4,38 37,39 42.473,40 47.03,41 28.71,42 27.896,44 6.027}
{0 CHEMBL1803068,1 8.431,2 44.4,3 37.8,4 1.025,5 1.121,6 0.68,7 0.674,8 379.4,9 6.7,10 12,11 45,13 15,14 32,16 49,17 20,20 16,21 4,22 3,24 17,25 8,28 3,29 5,32 28,35 11.1,36 0.082,37 4,38 41,39 46.127,40 50.448,41 30.619,42 30.326,44 5}
{0 CHEMBL1803069,1 8.24,2 46.2,3 38.5,4 1.015,5 1.118,6 0.691,7 0.676,8 321.36,9 7.7,10 12,11 39,13 15,14 27,16 42,17 18,20 16,21 2,22 3,24 15,25 6,28 3,29 3,32 24,35 7.7,36 0.071,37 3,38 36,39 39.589,40 43.614,41 26.949,42 26.369,44 5.337}
{0 CHEMBL1803070,1 8.434,2 45,3 37.5,4 1.023,5 1.121,6 0.685,7 0.677,8 337.36,9 7.5,10 12,11 40,13 15,14 28,16 43,17 18,20 16,21 2,22 3,24 15,25 7,28 3,29 4,32 25,35 10,36 0.07,37 3,38 37,39 40.916,40 44.824,41 27.404,42 27.084,44 5.409}
{0 CHEMBL1803071,1 8.172,2 44.2,3 39.5,4 1.019,5 1.122,6 0.678,7 0.665,8 351.39,9 7,10 12,11 43,13 15,14 29,16 46,17 19,20 16,21 3,22 3,24 17,25 7,28 3,29 4,32 26,35 9.3,36 0.087,37 4,38 38,39 43.8,40 48.239,41 29.165,42 28.611,44 5}
{0 CHEMBL1803072,1 8.699,2 45.2,3 35.7,4 1.03,5 1.12,6 0.687,7 0.686,8 365.37,9 7.1,10 12,11 42,13 15,14 31,16 46,17 19,20 16,21 3,22 3,24 15,25 8,28 3,29 5,32 27,35 11.9,36 0.065,37 3,38 40,39 43.244,40 47.033,41 28.858,42 28.799,44 5}
{0 CHEMBL1803073,1 8.431,2 44.4,3 37.8,4 1.025,5 1.121,6 0.68,7 0.674,8 379.4,9 6.7,10 12,11 45,13 15,14 32,16 49,17 20,20 16,21 4,22 3,24 17,25 8,28 3,29 5,32 28,35 11.1,36 0.061,37 3,38 41,39 46.127,40 50.448,41 30.619,42 30.326,44 5.444}
{0 CHEMBL1803076,1 7.204,2 38.9,3 47.2,4 1.004,5 1.134,6 0.646,7 0.616,8 259.34,9 8.3,10 6,11 36,13 9,14 20,16 37,17 14,20 10,21 4,22 3,24 17,25 5,28 3,29 2,32 19,35 5.6,36 0.108,37 4,38 26,39 36.145,40 40.82,41 23.256,42 22.181,44 5}
{0 CHEMBL1803078,1 9.207,2 40,3 45.7,4 1.001,5 1.127,6 0.69,7 0.643,8 322.23,9 8.6,10 6,11 35,13 9,14 20,15 1,16 36,17 14,20 10,21 4,22 3,24 16,25 5,26 1,28 3,29 1,32 19,34 1,35 2.9,36 0.111,37 4,38 26,39 35.047,40 39.452,41 24.154,42 22.492,43 2.9,44 5.056}
{0 CHEMBL1803079,1 7.809,2 40,3 42.9,4 1.017,5 1.132,6 0.656,7 0.639,8 273.32,9 8.6,10 6,11 35,13 9,14 22,16 37,17 14,20 10,21 4,22 3,24 15,25 6,28 3,29 3,32 20,35 8.6,36 0.108,37 4,38 28,39 35.589,40 39.614,41 22.949,42 22.369,44 5.658}
{0 CHEMBL1803081,1 7.765,2 44.4,3 42.2,4 1.008,5 1.121,6 0.677,7 0.654,8 349.42,9 6.7,10 12,11 45,13 15,14 29,16 48,17 20,20 16,21 4,22 3,24 19,25 6,28 3,29 3,32 26,35 6.7,36 0.104,37 5,38 38,39 45.356,40 50.445,41 30.472,42 29.423,44 5}
{0 CHEMBL1803082,1 8.103,2 40.6,3 40.6,4 1.022,5 1.131,6 0.662,7 0.651,8 259.29,9 9.4,10 6,11 32,13 9,14 21,16 34,17 13,20 10,21 3,22 3,24 13,25 6,28 3,29 3,32 19,35 9.4,36 0.088,37 3,38 27,39 32.705,40 36.199,41 21.188,42 20.843,44 5.432}
{0 CHEMBL1803083,1 7.926,2 41.7,3 41.7,4 1.016,5 1.128,6 0.665,7 0.649,8 285.33,9 8.3,10 6,11 36,13 9,14 24,16 39,17 15,20 10,21 5,22 3,24 15,25 6,28 3,29 3,32 21,35 8.3,36 0.103,37 4,38 30,39 36.589,40 40.614,41 23.949,42 23.369,44 6.215}
{0 CHEMBL1803084,1 8.24,2 46.2,3 38.5,4 1.015,5 1.118,6 0.691,7 0.676,8 321.36,9 7.7,10 12,11 39,13 15,14 27,16 42,17 18,20 16,21 2,22 3,24 15,25 6,28 3,29 3,32 24,35 7.7,36 0.071,37 3,38 36,39 39.589,40 43.614,41 26.949,42 26.369,44 5}
{0 CHEMBL1803085,1 8.739,2 45.9,3 35.1,4 1.028,5 1.119,6 0.693,7 0.691,8 323.33,9 8.1,10 12,11 37,13 15,14 27,16 40,17 17,20 16,21 1,22 3,24 13,25 7,28 3,29 4,32 24,35 10.8,36 0.075,37 3,38 36,39 38.033,40 41.409,41 25.642,42 25.557,44 6.284}
{0 CHEMBL269538,1 7.581,2 46.4,3 42.9,4 0.998,5 1.117,6 0.688,7 0.657,8 212.27,9 7.1,10 15,11 28,13 15,14 18,16 30,17 13,20 11,21 2,24 12,25 3,28 2,29 1,32 16,35 3.6,36 0.033,37 1,38 25.5,39 27.949,40 31.282,41 19.273,42 18.392,44 5}
{0 CHEMBL408982,1 7.792,2 40.6,3 46.9,4 1.001,5 1.117,6 0.684,7 0.635,8 249.36,9 3.1,10 6,11 32,13 8,14 18,16 33,17 13,20 9,21 4,22 2,24 15,25 4,26 1,28 1,29 2,31 1,32 17,35 6.3,36 0.091,37 3,38 23,39 32.018,40 35.744,41 21.892,42 20.326,44 5}
{0 CHEMBL485053,1 8.457,2 41.4,3 37.9,4 1.028,5 1.13,6 0.67,7 0.666,8 245.26,9 10.3,10 6,11 29,13 9,14 20,16 31,17 12,20 10,21 2,22 3,24 11,25 6,28 3,29 3,32 18,35 10.3,36 0.032,37 1,38 26,39 29.822,40 32.784,41 19.426,42 19.316,44 5.47}
