"oz1","oz2","oz3","oz4","oz5","oz6"
-1.3288909e+000,-4.8024118e-001,-1.7967995e+000,-5.4629907e-001,1.5658675e+000,1.5289194e+000
-1.0381070e+000,-9.2036219e-001,4.1462295e-001,-1.3716170e+000,-1.1830774e+000,-5.5737689e-001
-7.0162410e-001,-7.4644428e-001,-2.6248899e-001,-7.2724151e-002,-1.0721436e+000,3.1897624e-001
-1.0588104e+000,-8.1094229e-001,-5.1387929e-001,-2.7615045e-001,9.2612150e-001,4.9803421e-001
-6.3442701e-001,-7.1049600e-001,2.5242061e-001,7.9295038e-001,1.5182431e+000,1.2297242e+000
-1.3092518e+000,-9.5182796e-001,-1.1166655e+000,4.1568164e-001,-1.3187352e+000,3.8229308e-001
-4.6903978e-001,-1.9235947e-001,-1.8947366e-001,9.9410144e-001,-5.6900960e-001,1.3860989e+000
-1.0658159e+000,-4.8264505e-001,-1.1657140e+000,-1.2259562e+000,-9.4445444e-001,2.6322485e-001
-1.3927034e+000,-1.5914608e+000,-3.6088829e-001,7.1453452e-001,5.7129225e-001,1.5670105e-001
-1.3167199e+000,-6.1694585e-001,-1.2883014e+000,-7.7846184e-001,1.7128179e+000,6.9873419e-001
-8.0796763e-002,4.6659742e-001,-9.4789312e-001,1.5649480e+000,-7.3269269e-001,7.2574095e-001
-1.8403422e+000,-1.1972394e+000,-1.7250552e+000,1.7291428e+000,6.7667675e-001,8.3565480e-001
4.3817490e-001,5.6708744e-001,-6.7071162e-002,-1.2608649e+000,1.4148964e+000,-1.2748795e+000
-1.3713089e+000,-1.7210589e+000,3.6407647e-001,-5.2688692e-001,-1.5067054e+000,-6.8925908e-001
-5.2863606e-003,-1.0872149e+000,1.4079354e+000,1.5038154e+000,7.8555811e-001,1.8021643e+000
-6.3069696e-001,-8.5255713e-001,3.0073832e-001,1.5397628e+000,5.8560367e-001,1.2873419e+000
3.2402755e-002,7.5080006e-001,-9.8535735e-001,9.7228865e-001,8.4986147e-001,-5.0034544e-003
1.6283419e+000,1.2491747e+000,1.4838129e+000,-1.8164591e-002,7.1040459e-001,7.2481013e-001
-3.8745620e-003,-3.1131829e-001,6.4377971e-001,1.5983682e+000,3.1647700e-001,1.4598206e+000
1.3288014e+000,1.0181377e+000,5.5624650e-001,1.0225410e+000,1.4787615e+000,-5.1078549e-001
-1.2993150e+000,-1.4444997e+000,5.3244907e-001,1.1019593e-001,6.1016432e-001,-1.2300850e-001
-1.7186471e+000,-1.3250628e+000,-1.2089777e+000,2.2127876e-001,9.3870431e-001,3.8907553e-001
1.8635953e+000,1.2378193e+000,1.4563454e+000,1.6614261e+000,-1.0753164e+000,1.6354350e+000
3.3643103e-001,1.1849391e+000,-1.7076749e+000,-1.1017216e+000,3.8160085e-001,-1.4693365e+000
1.1196392e+000,8.6605118e-001,1.2634564e+000,1.0104521e+000,-1.5382102e+000,-1.0449575e+000
1.4079700e+000,1.5358161e+000,1.1044037e-001,-1.2360352e+000,9.8846276e-001,1.4773118e-002
-2.8609845e-001,-1.1025810e+000,1.6863549e+000,-1.2169351e+000,-5.2219687e-002,6.3238799e-001
6.9148450e-001,5.8188319e-001,2.1601242e-001,1.0470898e+000,1.7166965e+000,-7.6439232e-001
-4.7084103e-001,-5.0396884e-001,-4.2555607e-001,-1.7670290e-001,-3.0128744e-002,9.5273524e-001
1.1908546e-001,-8.6422496e-001,1.6266251e+000,-1.0287415e+000,1.6744942e+000,1.3573676e+000
-1.3228975e+000,-9.4432231e-001,-6.4747768e-001,-2.1474550e-001,-1.2943748e+000,-2.0980489e-001
-3.3791140e-001,-7.6317990e-001,9.6939911e-001,1.6543536e+000,-1.6206955e+000,1.5037877e+000
1.2779643e-001,3.9855121e-001,-2.5604512e-001,-1.1204563e+000,-3.5689452e-001,-8.0307599e-001
1.1654824e+000,3.7573535e-001,1.4261678e+000,-2.3814899e-001,-1.3039804e+000,-1.4417987e+000
-5.7714346e-001,-2.7995754e-001,-7.1927560e-001,-5.6798029e-002,1.5083723e+000,1.5794409e+000
9.9791852e-001,1.4065623e+000,-5.6971330e-002,1.6387516e+000,-1.4008306e+000,-2.5775471e-001
6.1656205e-001,7.4292541e-001,-6.6630186e-001,1.2040617e+000,-1.3687139e+000,-1.4796382e+000
-4.6557495e-001,-1.3582437e+000,9.8946912e-001,-8.0417401e-001,-1.0503864e-001,-2.7509558e-001
1.3512207e+000,5.3926517e-001,1.1490106e+000,1.1403536e+000,1.3544575e+000,-1.0321317e+000
6.7072865e-001,1.4480513e+000,-1.3785551e+000,-5.0146796e-001,-1.6132627e+000,-1.5846577e+000
-4.1873419e-001,-4.0893668e-001,1.7552446e-001,-1.7215997e+000,1.6477744e-001,2.5790994e-001
-2.1592801e+000,-1.3362662e+000,-1.6874774e+000,-1.8988076e-001,-1.0289492e+000,-6.1085644e-002
-1.0564761e+000,-1.6284570e+000,1.2251981e+000,-5.0094853e-001,1.1030730e+000,-3.8565774e-002
1.6014275e+000,1.1690847e+000,1.1905740e+000,-1.7053397e-001,-9.5375691e-001,-2.1937278e-001
-8.5902366e-001,-5.5778431e-001,-8.2985914e-001,8.1268930e-001,-8.4947115e-001,1.1990511e+000
-6.1290043e-001,-9.4407636e-001,2.0952857e-001,8.4026344e-001,-1.8177040e-001,6.8865696e-001
3.0826762e-001,-2.7158203e-001,1.5214955e+000,1.7094299e-001,-6.3881436e-001,1.1279539e+000
6.9994352e-001,1.3986609e+000,-1.1073132e+000,4.4521374e-001,-5.0751020e-001,-1.1452065e+000
-2.6503823e-001,-4.4672061e-002,-1.1792952e+000,4.2418057e-001,4.4269408e-001,1.4127487e+000
-1.2645546e-001,-4.9658452e-001,9.3271142e-001,4.5302936e-001,-2.3852253e-001,1.3246854e+000
-6.1068386e-001,-1.4416742e+000,1.5532853e+000,-1.4173112e-001,1.1642579e+000,7.9254475e-001
1.4812275e-001,6.0191413e-002,1.9250402e-002,5.6478480e-001,4.0572640e-002,4.4202680e-001
6.1032874e-001,7.8975753e-001,-9.6813489e-001,4.8288482e-001,8.7007853e-001,-1.1124369e+000
3.7242023e-001,4.5342368e-001,-2.1089145e-001,-1.2338074e+000,5.0876545e-001,-1.2997160e+000
-1.0291516e+000,-5.0204991e-001,-1.2987986e+000,1.4580577e+000,1.4774053e+000,1.9372895e+000
-2.4817190e-001,6.3404973e-003,-7.8131205e-001,1.2352633e+000,-3.1301170e-001,1.2512363e+000
-6.4067544e-001,-1.1644586e+000,4.5067438e-001,8.2960997e-002,9.0806286e-001,5.1972124e-001
1.0852079e+000,1.0553901e+000,4.8411329e-001,-1.0436188e+000,-8.0475032e-001,-1.8685404e+000
-1.2961380e+000,-1.7045221e+000,7.1912029e-001,1.0251566e+000,-6.1827982e-001,-7.7353445e-002
3.6396039e-001,4.3241532e-001,1.0703728e-001,-2.7679777e-001,-1.7244059e+000,-1.3502203e+000
1.1662780e+000,1.4880731e+000,-9.3785026e-002,-1.1168385e+000,-8.8650441e-001,-8.4263123e-001
-1.4064819e+000,-1.1840910e+000,-7.6577483e-001,-3.8029118e-001,-2.8330591e-001,-2.2741571e-001
-3.8472021e-001,-5.6459235e-001,6.2361690e-001,1.5672370e+000,1.2731892e+000,1.6303075e+000
-6.6552045e-001,-2.0265890e-001,-1.0745853e+000,-1.2569839e+000,1.2327402e+000,1.0301730e+000
4.6197127e-001,5.2529614e-001,-2.2738925e-002,-5.0487468e-001,-9.1434528e-001,-1.3623735e+000
5.3639800e-001,3.5167272e-001,3.0794841e-001,1.7371360e+000,-1.2584696e+000,-1.3458516e-001
-1.9508470e-001,-7.5665256e-001,1.5070806e+000,-5.1540394e-001,3.7594395e-001,1.2182403e+000
2.4846237e-001,5.7295273e-001,-5.6403815e-001,3.8464634e-001,1.3266867e+000,-4.3931891e-001
-1.2365769e+000,-1.5759118e+000,2.6750662e-001,-9.4296816e-001,9.5634729e-001,-6.5093188e-001
1.0833544e+000,1.1703751e+000,3.7988448e-001,1.5841308e+000,1.3482010e+000,-3.7704228e-001
-1.4648025e+000,-1.0805800e+000,-1.0717725e+000,1.1639180e+000,-1.0924451e+000,3.1594685e-001
-1.1786295e+000,-5.0659918e-001,-1.0546644e+000,7.8803087e-001,6.7679760e-001,1.1938215e+000
8.2193620e-001,1.0350719e+000,-7.8217396e-001,1.3923405e+000,1.6768740e+000,-1.2385305e+000
2.2006285e+000,1.7330281e+000,1.6042393e+000,2.6542242e-002,-1.7617364e+000,4.8161813e-001
9.5632221e-001,7.4318034e-001,3.3663002e-001,-1.2789403e+000,-7.6602397e-001,-2.6425203e+000
-2.3406010e-001,6.6805611e-001,-1.4637558e+000,2.7473082e-001,-2.2585701e-001,5.6536050e-001
-7.5494641e-001,-1.1261551e+000,9.6491268e-001,6.6379428e-002,1.0860912e+000,7.2175358e-001
6.4335378e-001,9.6460317e-001,-4.0957639e-002,-9.7246888e-001,-1.2275091e+000,-2.3484608e+000
-8.1634959e-001,-6.7177809e-001,-4.9414971e-001,1.3368816e-001,6.4718524e-001,9.1883458e-001
-2.0066808e+000,-1.6247657e+000,-1.1966697e+000,1.5241494e+000,-9.7314970e-001,2.0535126e-001
-6.6000012e-001,-1.4313054e+000,1.0541147e+000,9.6939436e-001,8.6951346e-001,3.6581017e-001
1.2899153e+000,4.1777532e-001,1.2215408e+000,1.0000368e+000,-1.6758184e+000,-1.2225565e+000
1.7022381e+000,1.4571117e+000,9.1627094e-001,1.6378719e+000,1.5779577e+000,2.1129820e+000
-1.2129747e+000,-7.6004171e-001,-8.9277932e-001,1.5524412e+000,4.6685565e-002,1.1420372e+000
6.4180312e-001,3.0674974e-001,1.1450165e+000,3.2995654e-001,9.9572731e-001,-1.9333112e-001
1.5433182e+000,1.0281228e+000,9.8496747e-001,4.8935408e-001,4.7630613e-001,-1.9478054e-001
2.3402800e-001,1.1625240e+000,-1.8119210e+000,7.9703189e-001,-2.6370938e-001,-7.7531532e-001
-5.0743975e-001,-1.3077184e+000,1.0059033e+000,-8.1110337e-002,2.3110930e-001,2.2465173e-001
-1.5582882e+000,-1.4294590e+000,-2.3573822e-001,-8.7452726e-001,1.5505858e+000,-2.6671183e-001
7.6968261e-002,8.0140124e-002,3.6012399e-002,-6.7023869e-001,-3.7360775e-001,-1.0339934e-001
-1.5486982e+000,-1.2907480e+000,-1.0245026e+000,-3.3660829e-002,6.6326684e-001,2.9319592e-002
-2.9610845e-001,-3.5318631e-001,2.7503701e-001,9.1927022e-001,-2.0461817e-002,1.2932897e+000
-1.5594702e+000,-8.6984586e-001,-1.7580496e+000,-7.7685601e-001,3.1797686e-001,4.5408222e-001
-6.6362947e-001,-1.0896624e+000,8.5232797e-001,1.0405524e+000,-4.4419249e-001,9.3347566e-001
-1.3650843e+000,-1.4944583e+000,3.9782414e-001,-1.6933571e+000,1.3481076e+000,-5.9841588e-001
-1.0104617e-001,-2.5945154e-001,-1.4539216e-001,1.4810247e+000,-1.2502962e+000,1.1108568e+000
1.7933866e-001,9.4615619e-001,-9.8657839e-001,8.2209619e-001,1.5958589e+000,-6.0156431e-001
-7.6654920e-001,-7.6542504e-001,-4.0702279e-001,1.2779264e+000,2.0698130e-002,1.1844523e+000
1.0812043e-002,-1.4513788e-001,3.6030403e-001,-1.1354174e+000,3.3789215e-001,5.2182234e-001
-4.1557603e-001,-9.7667366e-002,-3.8843114e-001,5.9581438e-001,-1.2916302e+000,7.8261977e-001
-5.1074238e-002,-5.5254533e-001,8.3248491e-001,1.6555925e+000,1.2251295e-002,1.8969398e+000
6.5812674e-001,1.5246400e+000,-1.1625053e+000,-9.6466717e-001,1.0445215e+000,-1.1543968e+000
-1.6423580e+000,-8.5441403e-001,-1.6191997e+000,1.0725842e+000,-1.4239379e-001,9.6692483e-001
-6.5631060e-001,-9.5501599e-001,6.7452320e-001,-1.4935411e+000,-1.0034761e+000,-4.7681793e-001
-1.0920516e+000,-3.6395124e-001,-1.0696224e+000,-1.1817302e+000,-7.3232030e-001,1.2292449e-001
1.3454873e+000,1.7292249e+000,-1.0403024e+000,1.5371947e+000,3.8791062e-001,1.7650188e+000
-1.6565940e+000,-1.5624291e+000,-3.1899835e-001,-1.6659308e+000,1.1355012e+000,-7.5560622e-001
-9.9987564e-001,-1.1827113e+000,1.5028741e-001,1.2558457e+000,-3.9270060e-001,3.5963581e-001
-8.5009565e-001,-1.5963100e+000,8.1698721e-001,5.1502632e-001,2.8706814e-001,4.0715430e-002
2.1388289e-001,3.8137559e-001,-2.8314955e-001,-1.6841421e+000,1.4648121e+000,-7.2783890e-001
2.8706901e-001,3.9838109e-001,-8.3826896e-001,-1.2614401e+000,-1.4982666e+000,-1.2981537e+000
7.9761915e-001,3.4026711e-001,8.4740639e-001,-1.2458623e+000,1.6250627e+000,-1.2754315e+000
1.0669489e+000,1.6259846e+000,-9.7598125e-001,-1.3787625e+000,1.3743153e+000,-3.8187180e-001
-1.3317632e+000,-1.0328641e+000,-1.2025061e+000,-3.8927022e-001,-3.0191260e-001,-3.0326543e-002
-1.4258193e+000,-1.4277574e+000,-6.4998662e-001,-8.3608766e-001,-2.7990668e-001,-3.2280250e-001
-1.5297293e+000,-1.5893970e+000,-3.9415381e-001,3.9265836e-001,1.2408784e+000,-2.2004589e-001
-2.7644719e-002,5.3781257e-001,-1.2003301e+000,3.9590919e-001,-1.6817508e+000,-1.3309299e-001
-2.2801901e-001,4.2715115e-001,-1.7346164e+000,-3.3084818e-001,-1.5240031e+000,5.1596963e-001
1.1809114e+000,4.2127425e-001,1.2768023e+000,-4.1479874e-001,1.2262953e+000,-1.2545473e+000
-6.9755782e-001,-1.5262210e+000,1.4465702e+000,-5.3290990e-001,6.2807740e-001,2.1133613e-001
-5.3892106e-001,3.4499622e-001,-1.5189417e+000,-5.2029296e-001,-7.9255087e-001,9.2563229e-001
4.2061950e-001,2.0892072e-001,6.3607018e-001,1.5622277e+000,1.1287070e+000,6.3699207e-001
7.4040306e-001,1.6270196e+000,-1.6450364e+000,-5.7732168e-001,-3.3108735e-002,-4.6322883e-001
-8.4676265e-001,-8.4991301e-001,-6.9207490e-001,-7.3057391e-001,1.6518945e+000,4.9554599e-001
1.6670987e-001,-4.5416424e-001,1.0631342e+000,-9.4250705e-001,-3.9844970e-001,8.8550802e-001
1.0503015e+000,1.3326812e+000,-3.6383149e-001,-7.7665993e-001,8.7923288e-002,-1.3060734e+000
1.6296579e+000,1.4448483e+000,4.5564850e-001,3.1111579e-001,-6.2788283e-001,5.8967311e-001
9.5821026e-001,8.7472219e-001,2.4049441e-001,-9.4641922e-001,-1.5557933e+000,-2.6898716e+000
1.3493715e+000,8.8728229e-001,1.0362894e+000,1.5479749e+000,-1.5483295e+000,-8.2300759e-001
1.3735944e-001,-7.9757527e-002,3.9734835e-001,8.4665613e-001,1.0732903e-001,8.5618179e-001
-6.7058725e-001,6.8279001e-002,-1.7280844e+000,-3.3062725e-001,4.0353274e-001,1.2879410e+000
7.3484186e-001,9.7435963e-001,1.7236009e-002,-8.4416060e-001,-5.2783354e-001,-2.2403825e+000
-5.1631145e-001,-1.1550413e+000,1.3375060e+000,-7.0414873e-001,-1.8300284e-001,1.5170140e-001
-5.7612912e-001,-6.8963296e-001,-4.8489781e-001,1.7866461e-001,-2.9438068e-001,8.2653202e-001
-8.7924805e-001,-1.9922935e-001,-1.1408435e+000,1.1118067e+000,7.1359953e-001,1.6445804e+000
-7.7262629e-001,-1.4473402e+000,9.4526381e-001,-1.6615032e-001,-1.7748666e+000,-4.4781139e-001
1.2657130e+000,1.1653686e+000,2.5808443e-001,-1.0153197e+000,-8.9480965e-001,-1.6057185e+000
5.3483565e-001,1.3797193e+000,-1.7369611e+000,-1.1632509e+000,-4.2028339e-001,-1.7015117e+000
-3.9249841e-001,7.3960238e-002,-8.0516489e-001,-2.5848696e-001,4.4952885e-001,9.3169601e-001
2.2890944e-001,4.4871152e-001,-6.9617326e-001,-1.4935327e+000,-4.0499055e-001,-1.0391279e+000
1.4631968e+000,1.4043982e+000,4.8391785e-001,-1.2784817e+000,1.0732357e+000,3.4063550e-001
2.3429480e-001,-5.4195428e-001,8.2773852e-001,-1.1665718e+000,-1.2649851e+000,3.6346831e-001
9.8754917e-001,5.1815026e-001,1.2049019e+000,-2.8126838e-001,1.2999827e+000,-1.2620396e+000
-1.5628699e+000,-1.6138851e+000,-6.6632465e-001,6.2931988e-001,-3.5130821e-001,7.6448675e-002
1.6697557e+000,1.4024630e+000,1.4744977e+000,2.6026077e-001,-4.0997461e-001,1.1079393e+000
8.0028380e-001,1.5386852e-001,1.5452908e+000,3.3881097e-001,1.4109149e-001,-1.2669412e-002
-7.7180127e-001,-6.7871126e-001,-1.9403850e-001,-1.5919550e+000,7.1499626e-001,1.8866379e-001
4.9619295e-001,-5.9390809e-001,1.6120440e+000,-1.3221444e+000,1.6697313e+000,1.3202462e+000
-3.1180523e-001,-1.1230404e+000,1.6601732e+000,-1.0753635e+000,3.8208462e-001,7.4220176e-001
3.7153072e-001,-5.1772796e-001,1.5928166e+000,7.2558331e-001,1.4685192e+000,2.2400167e+000
9.2917805e-001,8.1966764e-001,1.0563755e+000,-1.4623385e+000,6.2706801e-001,-1.7722538e+000
1.1453508e+000,1.3107513e+000,1.2681143e-001,1.6703836e+000,-1.7581217e+000,-4.6955252e-001
-7.4894940e-002,6.1283587e-001,-1.3022426e+000,1.5864676e+000,-1.6209186e+000,2.4149030e-001
1.5382550e+000,1.0221217e+000,1.0819137e+000,8.6713761e-001,1.5973240e+000,2.7312701e-001
1.1494562e+000,8.3569301e-001,1.0036675e+000,-7.6418984e-001,6.6535347e-001,-1.7780905e+000
-1.0057116e+000,-1.2818915e+000,5.3840120e-001,-1.6178040e+000,-1.0437078e+000,-8.3810461e-001
-5.1913295e-001,-9.8319892e-001,1.0649908e+000,-7.2687967e-001,2.8461207e-001,5.5968999e-001
-1.1386763e+000,-1.1535586e+000,2.0996067e-002,-7.1899742e-001,-1.6063982e+000,-4.0133284e-001
1.8620015e+000,1.7023841e+000,3.9137639e-001,6.7555723e-001,-6.6497934e-001,1.1335593e+000
-7.5706182e-001,-1.3425940e+000,6.8091218e-001,3.5555478e-002,-1.1715066e-001,3.8647385e-001
-3.1603408e-001,3.7134811e-001,-9.3693615e-001,-7.0080660e-001,-3.1681723e-001,3.4075910e-001
1.0660431e+000,7.2614238e-001,5.2011857e-001,-2.2213374e-002,8.3180726e-001,-1.7966596e+000
-8.0097085e-001,-2.9951156e-001,-1.0290268e+000,1.0516278e-001,7.4401201e-001,1.0918208e+000
-2.0670379e+000,-1.6918027e+000,-1.6980195e+000,1.3271479e+000,9.8751449e-001,1.1143735e+000
3.5960448e-001,8.5152136e-001,-9.7859443e-001,5.1472000e-002,9.3322564e-002,-1.4972788e+000
-1.7042297e+000,-1.4678788e+000,-5.4903243e-001,-1.4212136e+000,-5.0198827e-001,-1.0632265e+000
3.8192084e-001,4.8279910e-001,-2.9331981e-001,-1.1713814e+000,-7.8316106e-001,-1.5004938e+000
6.1571267e-001,5.8211209e-001,3.3822502e-001,4.3537339e-001,8.3438698e-001,-9.1121755e-001
7.8706031e-001,7.8111171e-001,-1.7539740e-001,-1.4818330e+000,-4.8916342e-001,-2.3474593e+000
3.0296273e-001,1.3785728e+000,-1.5884843e+000,1.1192245e+000,-1.3513884e+000,-1.2275644e+000
1.0104911e+000,1.4102042e+000,-3.2194875e-001,-1.5021329e+000,-1.0951394e+000,-1.6151555e+000
1.2757854e+000,6.8333652e-001,1.5345755e+000,6.1867933e-001,1.4190475e+000,-5.3232859e-001
1.2582505e+000,1.1604290e+000,3.7524027e-001,5.4336950e-001,1.4466846e+000,-3.4364123e-001
-3.0428549e-001,-2.4107839e-001,-4.1522815e-001,-3.0955131e-001,-1.4153146e+000,2.3378221e-001
-6.9577638e-001,-9.6103114e-001,-1.9333484e-001,7.5230835e-001,-9.9951402e-001,6.5289115e-001
7.4803165e-001,1.1337465e+000,-5.9965484e-001,-3.9729022e-001,1.5477433e+000,-1.5124139e+000
8.2963816e-001,1.4928161e+000,-1.0363183e+000,2.4647212e-001,-1.5710672e+000,-1.0274890e+000
1.1467107e+000,1.2886320e+000,-5.7118464e-001,-1.6477866e+000,-3.7376257e-001,-1.6801491e+000
-5.2078338e-001,-1.0763483e+000,9.6807658e-001,-7.7771310e-002,-8.7806480e-001,5.7219993e-001
2.2580886e+000,1.7347370e+000,1.4123419e+000,-1.4066372e+000,1.6436328e+000,3.1350076e-001
9.4008839e-001,7.3411769e-001,1.6268663e-001,4.9507513e-001,7.3742770e-002,-1.5151526e+000
6.2193277e-002,4.7651872e-001,-1.1101598e+000,1.1350245e+000,-6.9405210e-001,1.1031035e-001
-9.5310205e-002,-1.8237510e-002,1.3697762e-001,-1.5251760e+000,1.6668131e+000,1.8794240e-001
3.4507950e-001,-2.7233972e-001,1.3990412e+000,-8.7274251e-002,-1.2757596e-001,1.1279524e+000
1.5498011e-001,1.4382087e+000,-1.8103804e+000,-8.2119741e-001,9.1141893e-001,-1.4533132e+000
3.2229446e-001,6.3843894e-001,-6.0491953e-001,7.3213461e-001,-2.8763632e-002,-4.8924448e-001
-1.5991795e+000,-1.5881846e+000,5.9183173e-003,6.8651344e-001,1.0642015e+000,1.9303281e-001
-2.0337391e+000,-1.0513550e+000,-1.8209704e+000,-1.5022406e+000,9.8233665e-001,-6.2060657e-002
1.8154408e-001,2.7830166e-001,-2.6633228e-001,7.5614179e-001,-1.4338542e+000,1.1976705e-001
-1.5372668e+000,-9.7794026e-001,-1.3162415e+000,-7.6671061e-001,-4.5041550e-001,5.0424946e-002
-8.0253637e-001,-1.2200941e+000,7.4033442e-002,1.3257904e+000,1.6219833e+000,1.0308742e+000
-3.6698136e-001,4.7974360e-002,-6.2955527e-001,-6.1232308e-001,5.2829915e-001,6.9363843e-001
-8.8613689e-002,4.5620168e-001,-9.5695692e-001,-4.7868850e-001,-5.9025635e-001,-3.0909175e-001
1.6135846e+000,1.6459976e+000,3.6840891e-001,-4.1261215e-002,8.6836079e-002,8.8522970e-001
6.2899366e-001,3.9845062e-001,8.2333362e-001,-9.4369983e-001,-1.6845522e-001,-1.2626245e+000
1.6600566e+000,1.3798694e+000,3.0814970e-001,-4.7029762e-001,1.4508421e+000,5.9603657e-001
-7.6913758e-001,-9.8547479e-001,4.5869040e-001,2.0191846e-001,1.5326098e+000,9.1122863e-001
-1.7824970e+000,-1.0990738e+000,-1.2048535e+000,4.0073701e-002,-4.4577242e-001,-1.1877273e-001
-5.5140932e-001,-7.7862683e-001,1.0904208e+000,-9.1505131e-001,6.5588464e-001,8.0732372e-001
-1.2303049e+000,-9.6542570e-001,-6.7056867e-001,-6.8159699e-001,-1.7600874e+000,-1.9940918e-001
-1.2542752e+000,-5.6943825e-001,-1.0013404e+000,-5.2670525e-001,1.6705068e+000,8.0279703e-001
-7.2438953e-001,-1.6683298e+000,1.5085213e+000,1.0144235e+000,-1.5962190e-001,3.5382124e-001
-8.1224625e-001,-5.5653275e-001,-5.9134235e-001,-2.0528384e-001,1.9938876e-001,7.3325448e-001
-8.2168974e-001,-5.6303483e-001,-1.0184777e+000,4.6688318e-001,2.5037257e-001,1.0158083e+000
5.6001480e-001,-4.4535958e-002,1.1133389e+000,-5.3530695e-001,6.4261941e-001,3.5704470e-001
9.5109503e-001,9.5601720e-001,1.8107420e-001,-1.3362809e+000,-3.3977522e-001,-2.4305612e+000
-1.9255432e+000,-1.5310435e+000,-1.3606964e+000,-1.4640497e+000,7.5986151e-001,-5.3206391e-001
4.6658699e-001,1.5532959e+000,-1.4060234e+000,8.3756730e-001,-6.5456169e-002,-1.1260209e+000
-2.5505163e-001,-6.1775019e-001,3.5547605e-001,8.3819251e-001,-9.8375934e-001,1.0748738e+000
1.8769275e-001,5.6635488e-002,-4.1821466e-001,-8.2112740e-001,9.5030276e-001,1.8488310e-001
-9.4526754e-001,-1.4491451e+000,1.2953554e+000,1.6446013e+000,3.8893582e-001,1.1628052e+000
-3.2049883e-001,-3.3894978e-001,-8.1885272e-002,6.7800356e-001,-3.0792525e-001,1.2209179e+000
7.9611700e-001,4.8777644e-001,1.4646152e+000,7.0444554e-001,-7.0424619e-001,-9.4879149e-001
7.3999445e-002,1.0025353e+000,-1.7319735e+000,7.4114949e-001,-6.6238323e-001,-7.0900758e-001
-9.8547685e-001,-1.1444347e+000,-2.5133011e-001,-3.3940345e-001,-6.7828227e-001,-2.6420167e-001
1.9102566e+000,1.0801387e+000,1.6759864e+000,8.4837099e-001,8.7501569e-001,1.8358908e+000
6.1281886e-002,-8.6565818e-001,1.4648019e+000,-1.5537683e+000,-2.0134954e-001,6.8624722e-001
-1.2709139e+000,-6.4698086e-001,-1.1571802e+000,-3.9870943e-001,-4.5358637e-001,3.3384038e-001
-1.2464378e+000,-1.3946650e+000,-4.9936927e-002,1.6491070e+000,1.3257051e+000,5.6340997e-001
7.9998792e-001,5.9346996e-001,3.1268470e-001,-7.3912903e-001,-1.5298499e+000,-2.0210553e+000
1.0478513e+000,1.0250801e-001,1.6287825e+000,9.5920714e-001,-6.7814508e-001,-8.9549288e-002
2.7347643e-001,1.3042810e-001,4.4832643e-001,-3.6664266e-001,-1.3306190e+000,-5.0385847e-001
-8.7936028e-001,-8.0491900e-001,-2.3456956e-001,-2.9040089e-001,5.1209138e-001,4.8693547e-001
-1.4325062e+000,-1.1895708e+000,-2.5170559e-001,-8.4897095e-001,1.4521203e-001,-3.6465910e-001
5.8325236e-001,-7.0615994e-002,1.5999057e+000,-1.1374618e+000,3.6010016e-001,4.7140266e-001
-5.9488683e-001,-2.7749743e-001,-1.1075745e+000,1.5229059e-001,1.0900329e+000,1.4682531e+000
-2.1545008e+000,-1.6201917e+000,-1.3476232e+000,2.6893552e-001,-6.2329844e-001,-3.0495552e-001
-3.9121082e-001,-2.4306783e-001,-3.1290407e-001,8.0004441e-001,1.3471718e+000,1.3978296e+000
-3.7670371e-001,-1.2702716e+000,1.6789845e+000,-1.1163379e+000,-1.5632671e+000,1.1458874e-001
1.7783839e-001,4.9070087e-001,2.6073997e-002,1.4325633e+000,-6.9154776e-001,-2.7056786e-001
3.6249822e-001,4.5095794e-002,5.0015301e-001,-1.4812169e+000,-1.6002741e+000,-7.9520347e-001
3.3079158e-001,1.0641316e+000,-1.5093594e+000,8.0665289e-001,-1.0901607e+000,-1.0635469e+000
1.5664937e+000,9.3418840e-001,1.4703696e+000,1.6923098e+000,-1.6181988e+000,-1.6829753e-001
-1.2726422e-001,1.5604909e-001,-5.0228812e-001,-6.1523505e-001,-8.3577597e-001,1.9961720e-003
8.4632148e-001,9.3563864e-001,-4.2010234e-001,1.1041644e+000,-1.1046845e-001,-1.3424844e+000
1.4815707e+000,7.7896130e-001,1.5803454e+000,-7.5976282e-001,1.4568501e+000,-9.9090474e-001
-2.4061256e-001,9.3243384e-001,-1.6708176e+000,4.1843970e-003,-7.1351882e-001,2.5342345e-001
-7.3806963e-001,-4.1422190e-001,-1.1658127e+000,5.1435416e-002,5.0532445e-001,1.2410014e+000
9.2567936e-001,1.1182441e+000,-1.9517734e-002,1.1760140e+000,1.6629711e-001,-9.8567103e-001
6.8324068e-001,8.3969636e-001,2.9975183e-002,9.9456899e-002,1.6889090e+000,-1.6009344e+000
-7.4719899e-001,-1.0953250e+000,8.5314321e-001,-9.4316353e-001,4.2914250e-001,3.2386185e-001
-1.6596911e-002,6.3907013e-001,-1.2214104e+000,8.2664129e-001,-1.3693659e+000,-1.9627936e-001
1.0529103e+000,7.3541684e-001,1.1768963e+000,-1.4123556e+000,-1.0398959e+000,-2.0934292e+000
1.3493592e-001,-8.0284311e-002,3.4843155e-001,1.6314532e+000,1.0916083e+000,1.1677772e+000
1.2501809e+000,1.2132932e+000,1.0590359e+000,-8.6782336e-001,3.5261988e-001,-9.2015872e-001
1.1656997e+000,1.3771601e+000,7.2830420e-001,5.6537556e-001,-3.9525460e-001,-3.0978432e-001
4.5761031e-001,8.8652695e-001,-8.6122330e-001,-6.9185944e-001,-9.3873732e-001,-1.9355950e+000
-6.5643204e-001,-1.1739161e+000,1.0621851e+000,6.7832236e-001,-1.2480230e+000,1.8921612e-001
1.3107779e-001,3.2892901e-001,-8.2715872e-001,-1.6155716e-001,-9.3545696e-001,-1.2971701e-001
5.2152281e-001,5.4335547e-002,1.0837589e+000,-3.4329438e-001,-1.2797401e+000,-2.3056847e-001
-7.6235793e-001,-8.3606569e-001,-9.8489665e-002,5.9978581e-001,-1.3782412e+000,6.0263891e-001
-9.3823781e-001,-7.3484007e-001,-4.5850287e-001,1.6258622e+000,1.6471918e+000,1.5379219e+000
1.9623323e+000,1.5269045e+000,1.5571763e+000,-9.4259783e-002,-9.4439241e-001,1.3745249e+000
-3.7143543e-001,5.1716117e-001,-1.4627659e+000,1.7117256e+000,9.8165558e-001,1.6885642e+000
9.3618361e-001,1.3687592e+000,-4.9391276e-001,-6.6465298e-001,-3.4989112e-001,-1.5344805e+000
3.5063381e-001,2.8994710e-002,9.2744004e-001,4.7634347e-002,2.3875851e-001,5.6685426e-001
-5.6917856e-001,1.6743630e-001,-1.6820434e+000,-6.7296011e-001,-3.3274241e-001,1.2053647e+000
-7.1899525e-001,-1.1591214e+000,6.4104174e-001,-1.5732150e-001,-6.2504097e-001,1.6762233e-001
-5.6836801e-001,-3.6228493e-001,-8.3059707e-001,-2.8192581e-002,-1.7830882e+000,2.5717301e-001
8.8024816e-002,-7.7656465e-001,1.4356456e+000,-7.7561337e-001,-9.2977506e-001,8.0016603e-001
9.1211093e-001,1.6588880e+000,-1.4044783e+000,-9.5930020e-001,5.2017766e-001,-1.8884417e-001
3.9520840e-003,-4.6714611e-001,5.2355421e-001,1.3600441e+000,6.0766730e-001,1.6795544e+000
1.6851535e+000,1.5425059e+000,5.4930225e-001,-1.5052118e+000,-5.3422583e-002,1.5585338e-001
1.1017586e-001,5.2494586e-001,-1.2446227e+000,-1.4600519e+000,-5.6653743e-001,-1.0676677e+000
-1.1424216e+000,-8.1427453e-001,-7.2135855e-001,1.2935945e+000,-6.7558162e-001,6.4622407e-001
-1.6106546e+000,-1.3701795e+000,-2.4577172e-001,3.5051525e-001,3.3214576e-001,2.4545439e-001
1.3793545e+000,1.1616223e+000,6.2756546e-001,-6.0061464e-001,1.4831715e+000,-5.0241957e-001
-1.1521784e+000,-1.3824017e+000,5.8717662e-001,-6.7606209e-001,1.2981177e+000,-2.4289690e-001
1.8145458e+000,1.1747918e+000,1.4670495e+000,1.0093723e+000,-1.0139592e+000,1.0351995e+000
-1.3107405e+000,-8.7652759e-001,-1.6112477e+000,-7.8302071e-001,-1.4082992e+000,2.2915142e-001
1.2346060e+000,1.1426002e+000,1.0067281e+000,6.4021838e-001,-9.6514633e-001,-8.8895930e-001
1.0236491e+000,1.5152780e+000,-1.0530074e+000,-1.3466705e+000,-2.9856554e-001,-8.6493755e-001
7.3920756e-001,8.6534384e-001,5.1952245e-001,6.0014754e-001,1.7729127e-001,-1.6345589e+000
-6.3107547e-001,-1.8312906e-001,-1.0703694e+000,-5.2843699e-001,1.2317394e+000,1.0582607e+000
5.8000157e-002,-7.0757787e-001,7.6995706e-001,-3.9130428e-001,-4.6780006e-001,7.4367352e-001
-8.4819927e-001,-1.3358331e+000,8.5804382e-002,1.6545433e+000,-8.0707077e-001,4.6270322e-001
8.6404252e-004,-1.4099632e-001,3.4673797e-001,-1.5958828e+000,-1.6046608e+000,-2.3305115e-001
9.7612231e-001,8.9332428e-001,3.8905866e-001,-8.9537023e-001,5.6400206e-001,-1.9567624e+000
-2.1666386e-003,6.9852494e-002,-5.6012896e-001,9.4822322e-001,-1.6720871e+000,5.7646204e-001
-3.6716439e-001,-6.0208179e-002,-7.9042288e-001,1.1562798e+000,8.0367579e-001,1.4924797e+000
-1.9876979e-001,-1.1478416e+000,1.6878503e+000,1.6036745e+000,-3.7723173e-001,1.6304710e+000
1.9799486e+000,1.0902848e+000,1.6496055e+000,1.2784611e+000,1.2182495e+000,1.8048430e+000
4.6390332e-001,9.9386426e-001,-1.4925787e+000,1.5328004e+000,1.5225132e+000,-4.1622151e-001
5.2661816e-001,1.3377666e+000,-1.4088094e+000,1.2668178e+000,-9.2133391e-001,-1.1542335e+000
3.5811049e-001,1.4391313e-001,2.2244801e-001,-1.3999860e+000,-1.0109392e+000,-7.7993559e-001
-8.8532879e-001,-1.4307797e+000,1.2125404e+000,-1.4240730e+000,5.2358568e-001,-8.4012036e-002
-8.8008399e-001,-1.5190967e+000,1.6070596e+000,1.3874571e+000,-1.4446158e+000,5.4887358e-001
6.6534961e-001,-2.2405091e-001,1.5614434e+000,-2.0757782e-001,-8.0300840e-001,5.1069799e-001
-1.2266850e+000,-1.7028302e+000,4.9978469e-001,-1.2402799e+000,-1.2522911e+000,-1.0813963e+000
-1.0557250e+000,-8.5318324e-001,-6.9317549e-001,-1.2444838e+000,-5.6321723e-001,-1.8842738e-001
5.4828671e-001,1.1560073e+000,-1.1788669e+000,1.4302604e+000,1.3315945e+000,-7.0335130e-001
-1.0599417e+000,-9.8252255e-001,2.3620032e-001,-5.2081356e-001,1.5068226e+000,2.8139899e-001
-1.4562958e+000,-1.6409931e+000,-2.7583025e-001,-1.1450737e+000,-9.0922824e-001,-1.1207637e+000
4.4582087e-001,2.1516869e-001,5.7933968e-001,1.6513118e+000,5.3008025e-001,7.5259454e-001
1.1121278e+000,1.6949072e+000,-1.2883559e+000,-7.8982767e-001,1.0657918e+000,3.4058145e-001
-1.2716103e+000,-1.3203941e+000,-5.1165013e-001,-1.1567463e+000,-1.4761978e+000,-9.2777644e-001
6.8822875e-001,2.1636315e-001,5.8058653e-001,2.4122584e-001,-1.5556321e+000,-7.9278584e-001
-1.9941911e+000,-1.2831724e+000,-1.4906760e+000,1.3252408e+000,-7.3439479e-001,7.0361744e-001
8.9443772e-002,-2.6019268e-001,1.2342624e+000,4.9248684e-002,1.2881576e-001,1.2717104e+000
-1.0943093e+000,-4.7907766e-001,-1.2218701e+000,9.8378262e-001,1.6236750e+000,1.5507535e+000
8.5017405e-001,1.4989023e-001,1.4948892e+000,1.4366809e+000,5.9077752e-001,3.1583291e-001
5.2150453e-001,7.6846407e-001,4.8341477e-002,1.6403546e-001,-1.4398957e+000,-1.7322251e+000
-1.3059363e-001,1.9128117e-001,-6.9153856e-001,1.3935767e+000,-3.0072795e-001,9.8677283e-001
3.0899635e-001,4.6991319e-001,-7.4871998e-001,-3.8188169e-001,-5.9461666e-001,-7.8908111e-001
-3.7522442e-001,-6.5862519e-001,7.0814656e-001,1.6233607e-001,1.6276503e+000,1.3399251e+000
-6.3622171e-001,-1.3204915e+000,1.4609295e+000,1.5911324e+000,3.5763444e-001,1.0878910e+000
-8.5169967e-001,-1.2937300e+000,5.1187997e-001,-4.7833754e-001,7.3457717e-001,-6.1359463e-002
1.2434966e+000,1.2893146e+000,5.8743377e-001,-1.2714778e+000,1.1464934e+000,-6.3293766e-001
-8.1380815e-001,-1.4989059e+000,1.1066024e+000,9.5825046e-001,-1.1509934e-001,4.5714129e-001
1.4789079e+000,1.6708211e+000,4.7907099e-001,4.3957374e-001,4.0846629e-001,1.0760223e+000
-2.1949471e-002,-4.4982200e-001,6.8754115e-001,-1.7118294e+000,-1.8227594e-001,3.9940671e-001
5.7875023e-001,3.0325444e-001,9.3921860e-001,8.6370656e-002,1.5311231e+000,-1.6467533e-001
-5.4598473e-001,-7.7887428e-001,8.2242229e-002,6.4172318e-001,1.2297263e+000,1.2815526e+000
1.4189800e-001,4.8995750e-002,1.1682380e-002,1.2076740e+000,1.3628230e+000,1.1786974e+000
-2.1329053e-001,-3.4154620e-001,4.4471655e-001,-8.5807460e-001,1.3977570e+000,7.1832414e-001
1.4381519e+000,1.7618725e+000,-8.5127980e-002,-1.1948051e+000,-6.0498536e-001,1.1603881e-001
-1.6996128e+000,-1.3373834e+000,-1.3181569e+000,9.9439687e-001,-1.1514019e+000,2.5886984e-001
-2.7164982e-001,-8.6192958e-002,-6.4170783e-001,-7.6530938e-001,-4.1423391e-001,4.4079877e-001
6.6388508e-002,9.6511121e-001,-1.4573899e+000,-1.7232994e+000,-4.1906552e-001,-1.6841372e+000
1.1299689e+000,1.7178527e+000,-1.4058898e+000,2.7169141e-001,-8.0232624e-001,8.3444392e-001
-4.5152902e-001,-7.1674656e-001,8.3402555e-002,-1.0409704e+000,-2.1644365e-001,1.9196033e-001
-1.1686543e+000,-1.7155661e+000,1.3058559e+000,-7.0075458e-001,-4.3285332e-001,-2.4678504e-001
-7.2570284e-001,-6.2341286e-001,-4.7388624e-001,1.3413899e+000,-2.2575028e-001,1.3903069e+000
8.0288044e-001,1.7461296e+000,-1.7067053e+000,-1.4208152e+000,1.6789630e-001,-5.6516589e-001
-4.8380561e-001,-7.1771986e-001,5.7101284e-001,-1.4592999e+000,-3.4880095e-001,5.4317404e-002
5.5353402e-001,-3.0392055e-001,1.4994562e+000,-1.4529460e+000,-8.2362624e-001,3.9039919e-001
-3.5230497e-001,-1.2581807e+000,1.5208817e+000,-8.2067984e-001,-1.3700159e+000,2.6448214e-001
6.0745858e-001,-1.1173490e-001,1.2300118e+000,-7.0980057e-001,7.6123526e-001,3.5861867e-001
-1.8609107e-001,-9.0254285e-001,1.0487243e+000,1.2488930e+000,-1.6271237e+000,9.6323695e-001
9.4999871e-001,1.7748937e+000,-1.6777274e+000,-3.0705432e-001,1.3812313e+000,7.0458688e-001
-9.5679206e-001,-8.6354012e-001,1.3809792e-001,2.1879287e-001,1.1438140e+000,6.0689951e-001
1.1037333e+000,1.0277739e+000,4.4177261e-001,1.7388965e+000,1.5532990e+000,-6.0213595e-001
-4.7290150e-001,-1.7518633e-001,-9.0699622e-001,-8.3839422e-001,-5.8984780e-001,8.6085649e-001
1.0682917e+000,1.0044185e+000,2.3599227e-001,5.1960943e-001,2.0299631e-001,-1.1263023e+000
1.8969135e-001,-6.9635010e-001,1.5267491e+000,8.7972717e-001,-1.6741203e-001,1.8775328e+000
4.2734200e-001,1.1735502e+000,-1.4923096e+000,-4.2945722e-001,-3.4211862e-001,-1.8583455e+000
5.3435906e-001,7.4812640e-001,2.4331832e-001,-3.7484701e-001,1.4866365e+000,-1.2244558e+000
1.1787893e+000,1.4522497e+000,-7.5646220e-001,-1.3051844e+000,-1.7403187e+000,-1.2728529e+000
4.9895563e-001,3.1265322e-001,2.5080967e-002,8.1622768e-001,-5.6576433e-002,-5.2611358e-001
4.4086222e-001,2.9488632e-001,3.1292714e-001,2.1992345e-001,1.9001346e-001,-7.0630587e-001
-9.7154094e-001,-2.6566005e-001,-1.7855824e+000,-1.7000992e+000,-1.5389851e+000,4.1591281e-001
-1.2788757e+000,-1.0969773e+000,-7.6475756e-001,-1.5937403e+000,9.0980178e-001,-4.9536653e-001
-8.6456628e-001,-3.7932571e-001,-7.3872646e-001,-3.6231311e-001,2.0287437e-001,8.8805870e-001
9.6000423e-001,1.4389629e+000,-6.5342452e-001,-1.1763143e+000,-2.5140083e-002,-1.1561195e+000
-9.0067594e-001,-1.4083788e+000,3.8400239e-001,8.5894235e-001,-1.3694797e+000,-2.5490738e-002
1.5389540e+000,1.1343833e+000,1.2375936e+000,1.0178756e+000,-5.9046506e-001,4.0044439e-001
4.9862043e-001,-1.7522499e-001,1.3003011e+000,1.5603315e+000,-1.7485959e+000,7.5549374e-001
-1.1432695e+000,-5.4931766e-001,-1.1370132e+000,-1.5083377e+000,9.9782943e-001,6.5423097e-001
-4.0469477e-002,4.7275861e-001,-1.2038518e+000,6.8613998e-001,-1.2800585e+000,3.5758238e-002
1.6384415e+000,1.2359278e+000,1.4780097e+000,-9.1903427e-001,1.4802470e+000,7.0624209e-001
2.0016019e+000,1.5529306e+000,1.4351517e+000,7.9377765e-001,8.9046823e-002,1.8912966e+000
1.6075720e-001,-1.3265742e-001,-2.9481470e-002,6.8680211e-001,-2.6453148e-001,7.8506030e-001
2.2217556e-001,8.6769730e-001,-1.6001596e+000,1.3004484e+000,7.2720582e-002,-3.1875669e-001
-6.9621191e-001,-1.5369787e+000,1.1287460e+000,1.3608445e+000,5.3293719e-002,9.1660152e-001
-1.0307540e+000,-1.5248223e+000,6.3395669e-001,-1.6746270e+000,9.0440095e-001,-6.8868146e-001
4.9918829e-001,-6.8576837e-002,1.3075284e+000,-9.9457175e-001,4.4366563e-002,3.4767830e-001
3.4289581e-001,-2.0376023e-001,8.8019711e-001,2.5738357e-001,-1.1123943e+000,7.6736052e-001
1.3190602e-001,5.1904695e-002,3.2383306e-001,-5.8793625e-001,-6.5483545e-001,-3.3128312e-003
-4.0139585e-001,6.4517848e-001,-1.0499061e+000,9.8537643e-001,-1.5047042e+000,3.2875616e-001
8.0009073e-001,1.9231055e-001,6.7176129e-001,6.0700367e-001,2.6008583e-001,-4.1954706e-001
6.0248029e-001,7.6940762e-001,-2.1661656e-001,-1.5654260e+000,1.0408815e+000,-2.1128222e+000
-1.0637024e+000,-5.8502494e-001,-1.1294395e+000,3.5564294e-002,-5.7728431e-001,6.3594628e-001
1.8543590e+000,1.5610338e+000,1.1409910e+000,-1.0763535e+000,-2.8604030e-001,6.6451741e-001
1.2008917e+000,9.0255740e-001,1.5467304e+000,-3.0073568e-001,3.3406570e-002,-9.9995816e-001
-1.1205060e+000,-1.6669762e+000,1.2375814e+000,5.3672325e-001,1.4912821e-001,1.8643361e-001
8.0315443e-001,-3.1646360e-002,1.1056482e+000,1.2656467e+000,1.5353273e+000,5.5585180e-001
-1.0505000e+000,-6.7074225e-001,-1.3043668e+000,-1.2026895e+000,3.0695025e-001,4.1729884e-001
9.8843240e-001,8.7351692e-001,7.2675319e-001,-9.6073108e-001,1.0122809e+000,-1.8417911e+000
-2.6476854e-001,-4.2058604e-001,3.2638994e-001,-3.0437056e-001,-9.8165924e-001,5.2636022e-001
-2.0083387e-002,1.5700539e-002,-8.4607148e-002,8.4330909e-002,4.3152912e-001,5.2874022e-001
-8.8959878e-001,-1.0894885e+000,7.1890348e-002,8.6109736e-001,-6.5246312e-001,4.7031128e-001
1.6441539e+000,1.7677816e+000,1.4784449e-002,1.9856239e-001,-3.3993947e-001,1.0021991e+000
1.4293230e-001,2.6450559e-001,1.1025499e-001,-1.4714438e+000,-8.5268420e-001,-6.7564823e-001
8.4925694e-001,1.4005456e+000,-5.3675677e-001,6.9054160e-001,-9.7406226e-002,-9.6123551e-001
1.4767434e+000,1.5758248e+000,-3.7793295e-002,-1.4117530e+000,2.1723621e-001,-4.1314321e-002
1.0304284e+000,8.1735043e-001,3.7580227e-001,-1.1215646e-001,1.3393483e+000,-1.8181776e+000
-2.6003877e-001,-6.5772890e-001,7.7186649e-001,5.1662526e-001,9.1995768e-001,1.4350220e+000
1.8278354e+000,1.7561015e+000,4.5067772e-001,-3.3956575e-001,5.9417170e-001,7.4048704e-001
9.4957132e-002,8.0239748e-001,-9.3474554e-001,4.7720163e-001,1.2159547e+000,-3.8530665e-001
7.6811425e-001,6.1949956e-001,1.3047866e+000,-2.2182879e-001,1.4753075e-001,-1.4795313e+000
-4.3605474e-001,-9.9681272e-001,1.1478612e+000,1.6020229e+000,-2.9880722e-001,1.5253646e+000
-1.4340279e+000,-7.2725217e-001,-7.9453813e-001,7.4450028e-001,-9.8443847e-001,3.2255956e-001
9.9652027e-001,5.4933378e-001,1.6187502e+000,-5.0390284e-001,1.2236784e+000,-9.9838630e-001
6.0791694e-001,-4.5629881e-002,1.3781851e+000,-6.7249706e-001,-3.2241487e-001,-1.3233513e-001
-6.9331836e-001,-8.7226049e-001,1.0108933e-001,1.7273532e+000,1.3917756e-001,1.0626397e+000
-9.7778277e-001,-7.7012941e-001,-1.9896929e-001,-4.6144674e-001,-1.1297264e+000,5.3156215e-002
8.7525581e-001,6.2420898e-001,3.7812142e-001,-2.8821968e-001,1.3919610e+000,-1.7025686e+000
-1.4641810e+000,-1.5898682e+000,-1.0144951e-001,-7.1664399e-001,9.2028713e-001,-3.2569927e-001
4.0286180e-001,3.3984967e-001,3.0034657e-001,1.6251076e+000,1.2355689e+000,2.2074405e-001
1.7900543e-001,8.1489906e-001,-1.3340908e+000,-1.0034880e+000,-3.3001444e-001,-1.5022883e+000
-1.5569938e+000,-1.3108812e+000,-5.4641522e-001,-1.2478004e+000,1.3226350e-001,-7.4513241e-001
8.2133516e-001,2.1345756e-001,1.4128225e+000,-3.6928947e-001,-6.6148318e-001,-9.2092266e-001
3.0220543e-001,5.0397705e-001,6.7318162e-002,1.2416388e+000,3.5729034e-001,-2.8871780e-001
-1.2876254e+000,-1.0766925e+000,-6.7647977e-001,1.3733633e+000,-9.8855070e-001,5.2725996e-001
2.0488631e-001,5.6926551e-001,-1.0526667e+000,-1.3226027e+000,1.2362155e+000,-1.0170390e+000
-1.8493203e+000,-1.6499399e+000,-1.0199569e+000,1.4445968e+000,-1.7050387e+000,4.0978017e-002
1.3587645e+000,8.4253691e-001,1.0591856e+000,1.1119807e+000,1.3736290e-001,-5.2783884e-001
-9.9580305e-001,-1.1771314e+000,3.3335110e-001,2.9424329e-001,1.2471928e+000,5.0244368e-001
-1.9940906e+000,-1.4183097e+000,-1.1424341e+000,1.2338786e+000,1.0057216e+000,4.6880913e-001
-8.5148692e-001,-1.2943662e+000,8.7769065e-001,-1.0072591e+000,4.8219830e-001,-1.3263184e-001
5.7636109e-001,1.5295862e+000,-8.6115991e-001,-1.5440557e+000,-6.6231507e-001,-2.3035808e+000
1.4203392e+000,1.0152524e+000,1.1808657e+000,-1.3714093e+000,1.6857457e+000,-1.0508674e+000
-1.4076288e+000,-1.2506472e+000,-6.6847471e-001,7.5774655e-001,-1.0993185e-001,3.0058151e-001
1.4776754e+000,1.5825381e+000,9.1523930e-002,1.0308109e+000,-7.3475065e-001,8.6829989e-001
-9.4586767e-001,-1.2499945e+000,6.7345174e-001,5.4637757e-001,-1.3575506e+000,1.8729236e-001
-1.1788220e+000,-9.4788218e-002,-1.7909625e+000,-1.3707012e+000,1.6257925e+000,1.1249227e+000
1.0286492e+000,4.2540671e-001,1.1217370e+000,4.7966013e-001,-1.7488616e+000,-1.3814035e+000
6.7755164e-001,9.2395393e-001,-2.6465359e-001,1.1415708e+000,1.9395673e-001,-1.3130359e+000
-1.5892642e+000,-9.3955792e-001,-1.3907132e+000,-1.0909052e+000,1.5492977e+000,-5.9017559e-002
-3.8440459e-001,-8.4065071e-001,1.1858999e+000,-7.8963689e-001,-3.1175447e-001,6.6422284e-001
3.9485330e-001,9.7693124e-001,-9.4395918e-001,-3.8488379e-001,-8.9991691e-001,-1.5900038e+000
2.2850531e-001,2.0388647e-001,4.5972782e-001,-4.0502007e-001,1.6704938e-002,4.7834978e-002
1.5401570e+000,1.6365650e+000,1.3045421e-001,2.5789031e-001,-1.0078106e+000,5.8181309e-001
-8.5343313e-001,-1.1841460e+000,3.3824701e-001,1.2590572e+000,1.1702628e+000,1.1223112e+000
-2.0209385e+000,-1.2744863e+000,-1.6353676e+000,-6.7787931e-001,-6.8731896e-001,-2.6053196e-001
3.3234973e-001,9.5193719e-001,-1.3824150e+000,1.8799641e-001,1.5881174e+000,-8.0472329e-001
-3.0678637e-001,-3.6303026e-001,2.1531264e-001,-4.0969599e-004,9.9373455e-002,9.9154077e-001
8.7898645e-002,-4.2348899e-001,1.0266969e+000,1.3444725e+000,5.2336980e-001,1.6134065e+000
2.1450608e-001,3.6757009e-002,2.7256190e-001,-4.6004091e-002,1.1170395e-001,3.0010607e-001
3.5473054e-001,8.9462130e-001,-8.1504952e-001,-1.6059567e+000,5.0981929e-001,-1.9490644e+000
-1.0170525e+000,-1.6744376e+000,1.0385065e+000,5.5040871e-001,7.7127422e-001,5.4854024e-001
4.2705819e-001,6.9372834e-001,-2.6283924e-001,-1.7730749e-001,-7.6948421e-001,-1.6561740e+000
2.0233423e-001,1.4721032e-001,-2.1544225e-001,-1.8824680e-001,-1.2002408e+000,-7.5552668e-002
-6.0553359e-001,-2.6146751e-001,-1.0322215e+000,-7.1343017e-001,1.6349863e+000,1.1237177e+000
1.3485624e+000,1.3622178e+000,-3.9929120e-001,-1.5512667e+000,-2.2091210e-001,-7.8614299e-001
-1.3925087e+000,-1.4048085e+000,-3.2851410e-001,-1.1553589e+000,-1.4416135e-001,-7.1936128e-001
-1.5606766e+000,-1.5979809e+000,-7.8716281e-001,-1.2776911e-002,1.1917674e+000,-2.6556216e-001
8.3583828e-001,1.4442548e-001,1.1897788e+000,1.7261003e+000,-2.1393974e-001,2.4034657e-001
-5.4676237e-001,2.4733330e-002,-1.2887649e+000,-1.2723960e+000,-1.7722368e+000,6.1284150e-001
-2.1022678e+000,-1.4983282e+000,-1.1880818e+000,-1.2040775e+000,-6.8882880e-001,-7.9598460e-001
-2.3347220e-001,-4.5780408e-001,6.9959815e-001,-2.2644798e-001,-6.1132903e-001,9.8469455e-001
2.1445708e-001,7.6713175e-001,-7.0298078e-001,1.5751435e+000,1.1217953e+000,-4.2089254e-002
1.4114764e+000,3.7944044e-001,1.4311933e+000,-8.6453367e-001,-9.4817379e-001,-1.9760361e+000
3.2108532e-001,1.3916580e-001,6.3900247e-001,1.2379904e+000,-7.5201895e-001,1.9379230e-001
2.1230614e+000,1.6003850e+000,1.3117085e+000,-1.9407128e-001,9.8298684e-001,7.2813407e-001
-2.1255046e+000,-1.4621700e+000,-1.6451424e+000,-6.0853454e-001,1.3680273e+000,3.3180303e-002
-4.6671802e-001,-1.3363252e+000,1.6424576e+000,8.2976157e-001,-1.7414160e+000,7.9568840e-001
-9.8031021e-001,-1.9666650e-001,-1.6823070e+000,1.2391503e+000,-1.6044930e+000,1.7160754e+000
-1.6081819e+000,-1.4250757e+000,4.2231711e-001,9.4789274e-002,-2.3066089e-001,-1.1115701e-001
7.1082650e-001,5.2260801e-001,5.4085928e-002,-1.5829318e+000,-1.3906938e+000,-2.3189501e+000
9.9614478e-002,-1.5188302e-001,4.7099435e-001,1.5504007e+000,-1.2934155e+000,1.0982857e+000
-3.3218370e-001,1.4000218e-001,-1.1837862e+000,9.0811421e-001,2.2706596e-001,1.3206887e+000
1.0517893e+000,1.0475626e+000,1.1445645e-001,1.2088669e+000,2.8092413e-001,-9.9357140e-001
3.8207074e-001,-5.4745373e-001,1.3985181e+000,-1.1482593e+000,-1.7590244e+000,6.5963486e-001
-6.0929831e-001,-3.7963871e-002,-1.5101108e+000,-6.1998735e-001,-1.4887169e-001,9.2235970e-001
-5.7365799e-002,6.3827359e-001,-1.1722773e+000,-4.2546784e-001,7.1903470e-001,-2.3340817e-001
1.7282806e+000,1.1019322e+000,6.9000759e-001,-6.1521884e-001,8.6283831e-001,7.2835410e-003
-1.5564712e+000,-1.4613798e+000,-4.1696863e-001,1.2181606e+000,-1.2588492e+000,-5.4644957e-002
7.0983338e-001,1.2288988e+000,-1.1865125e+000,-1.1839208e+000,1.5655847e-001,-2.0447769e+000
1.2166645e+000,8.1926404e-001,6.3173690e-001,-8.3880013e-001,4.1658121e-002,-1.9121406e+000
1.2439049e-001,2.9619450e-001,-5.6631967e-001,6.2166094e-001,4.6814903e-001,4.4898125e-001
7.6371604e-001,-1.4146216e-001,1.4523940e+000,9.6487009e-001,1.4585873e+000,1.3230466e+000
-1.2682183e+000,-9.4277665e-001,-1.4145712e+000,-3.1557359e-003,1.2394329e+000,8.9833310e-001
7.2942431e-001,8.9431431e-002,1.5426839e+000,-8.1304751e-002,-1.3565158e+000,-2.9957758e-001
-1.5106857e+000,-1.6382373e+000,1.2908369e-001,1.1167837e+000,8.4931077e-001,-2.2404111e-002
4.0427441e-001,3.6127678e-001,-4.5376308e-001,1.1408871e+000,-1.7632699e+000,-3.9600966e-001
1.2119532e-001,-5.2702485e-001,1.0600507e+000,-1.0425774e+000,-1.3597552e+000,5.3684921e-001
-8.4369295e-001,-8.5306290e-002,-1.3458209e+000,1.3064672e+000,-9.5541757e-001,1.6572166e+000
-1.6552071e+000,-1.3880281e+000,-1.2843412e+000,5.9888334e-001,3.9686685e-001,3.5862898e-001
-8.3451259e-001,-7.3615238e-001,-2.6938006e-001,-2.1376107e-001,-1.7034972e+000,2.1328227e-001
6.7338022e-001,7.9837417e-001,-1.2298331e-001,4.5197359e-002,-3.4252700e-001,-1.8385174e+000
1.3011636e+000,5.7408983e-001,1.6655839e+000,1.6427078e+000,-6.4145855e-001,-6.1899553e-001
7.8309256e-001,1.1686975e+000,-8.5940139e-002,-4.8979751e-001,8.4779835e-001,-1.7212813e+000
-1.0464236e+000,-9.8737163e-002,-1.7387442e+000,-5.0739626e-001,1.5088458e+000,1.3443144e+000
8.3793011e-001,1.7488945e+000,-1.6551869e+000,-1.6645940e-001,3.4445782e-001,2.8790413e-001
7.3653819e-002,3.9135077e-001,-1.3296996e+000,-6.0762598e-001,7.2000211e-001,-4.3168463e-002
-1.1508992e+000,-1.6262734e+000,9.3026820e-001,1.6286209e+000,-4.1398054e-002,5.7238537e-001
2.1738530e+000,1.7710339e+000,1.0021252e+000,-5.1870362e-001,1.3643040e+000,5.5380340e-001
4.2912540e-001,-1.8910104e-001,9.8795128e-001,-7.4612588e-001,-1.4081321e+000,3.7597424e-001
8.4719231e-001,2.5502424e-001,6.9403399e-001,-8.1765989e-001,-8.7326974e-001,-1.3582094e+000
1.3497073e+000,1.6492673e+000,2.3359420e-002,7.2094437e-001,1.3356152e+000,9.9283216e-001
-1.3225109e+000,-1.2847202e+000,-5.5078412e-001,3.4521167e-001,9.4467296e-001,3.6369127e-001
-1.6448300e+000,-1.0551390e+000,-1.4653917e+000,-6.5961952e-001,8.4135774e-001,2.3538337e-001
5.5799692e-001,1.2704676e+000,-1.2252395e+000,1.2135230e+000,1.4183634e+000,-7.4629278e-001
2.0171345e-001,7.0293561e-001,-1.1612783e+000,-3.5766502e-001,1.0913437e+000,-8.0222597e-001
2.2060145e+000,1.7435987e+000,1.6252234e+000,-1.2476434e+000,-1.4433350e+000,-1.7371097e-001
-2.9540178e-001,-3.1996429e-002,-5.4048797e-001,-1.6571874e+000,-1.7168743e+000,-2.0336024e-001
-1.0366125e+000,-1.6288173e+000,1.4565789e+000,1.5886261e+000,-7.3330858e-001,4.4432925e-001
6.8823538e-001,1.4669564e+000,-9.5123953e-001,6.4687154e-001,5.0281446e-001,-9.1541622e-001
7.4749109e-001,2.4689460e-001,1.0954237e+000,-1.5029315e+000,3.3837376e-001,-1.2714783e+000
-8.3053087e-002,-6.5025820e-001,1.2869221e+000,-1.6166539e+000,1.1749570e-001,7.3795078e-001
1.9636965e+000,1.5569136e+000,1.3944786e+000,1.7255831e+000,4.4804149e-001,2.3038709e+000
1.8322938e-001,7.8646181e-001,-1.2653195e+000,1.4533409e+000,2.6723990e-001,-2.0445324e-001
1.0481412e+000,7.4000627e-001,6.2042344e-001,1.6186158e+000,-8.4293562e-001,-1.2278062e+000
8.0350192e-001,3.3446450e-001,1.2432341e+000,-5.4187919e-001,3.1815919e-001,-7.9502491e-001
-4.9693827e-001,7.9932320e-002,-1.7005296e+000,3.3502705e-001,1.2196555e+000,1.7756237e+000
-9.0234460e-001,-1.3685926e+000,7.2577029e-001,-9.4658947e-001,8.2452599e-001,1.3970453e-002
1.5643879e+000,7.0188024e-001,1.4189484e+000,1.1207753e+000,9.2948036e-001,-5.2731692e-001
1.2318595e+000,1.5791719e+000,-8.5601058e-001,-1.3787568e+000,4.9648714e-001,-1.9498622e-001
-1.3430898e+000,-7.1067118e-001,-6.0784375e-001,5.6641643e-002,1.1093386e+000,5.0054982e-001
-1.8677944e+000,-1.2536626e+000,-1.3582307e+000,-5.3253533e-001,2.5189167e-001,-1.6199670e-001
2.1290435e+000,1.4716717e+000,1.5976248e+000,3.5348240e-001,-1.3702908e+000,1.2968328e+000
5.0633960e-001,3.7699291e-001,3.2986885e-001,9.4285602e-001,-1.4072655e+000,-8.3658093e-001
4.2905640e-001,2.7495916e-001,9.5902488e-001,6.1220488e-002,-3.8060930e-001,-2.5941193e-001
8.0752020e-001,1.3476927e+000,-1.6433708e-001,-1.8897842e-001,-1.6774314e+000,-1.4551641e+000
4.4771158e-001,3.6738284e-001,-5.9379617e-002,-1.2203361e-001,-6.4574319e-001,-7.9800588e-001
2.8613500e-001,5.8170534e-001,-5.5508913e-001,-9.3136972e-001,-2.1704478e-001,-1.2729783e+000
3.3109659e-001,7.4659744e-001,-4.8670508e-001,1.3613829e+000,1.6474771e+000,-1.7297491e-001
1.7037804e-001,7.3933631e-001,-6.9658981e-001,-1.0349761e+000,6.2210257e-001,-1.2013640e+000
7.7821582e-001,1.1513127e+000,-6.8360312e-001,-1.0661268e+000,2.0926040e-001,-2.1147864e+000
