{
  "data_features": {
    "feature": [
      {
        "data_type": "nominal",
        "index": "0",
        "is_ignore": "true",
        "is_row_identifier": "false",
        "is_target": "false",
        "name": "animal",
        "nominal_value": [
          "aardvark",
          "antelope",
          "bass",
          "bear",
          "boar",
          "buffalo",
          "calf",
          "carp",
          "catfish",
          "cavy",
          "cheetah",
          "chicken",
          "chub",
          "clam",
          "crab",
          "crayfish",
          "crow",
          "deer",
          "dogfish",
          "dolphin",
          "dove",
          "duck",
          "elephant",
          "flamingo",
          "flea",
          "frog",
          "fruitbat",
          "giraffe",
          "girl",
          "gnat",
          "goat",
          "gorilla",
          "gull",
          "haddock",
          "hamster",
          "hare",
          "hawk",
          "herring",
          "honeybee",
          "housefly",
          "kiwi",
          "ladybird",
          "lark",
          "leopard",
          "lion",
          "lobster",
          "lynx",
          "mink",
          "mole",
          "mongoose",
          "moth",
          "newt",
          "octopus",
          "opossum",
          "oryx",
          "ostrich",
          "parakeet",
          "penguin",
          "pheasant",
          "pike",
          "piranha",
          "pitviper",
          "platypus",
          "polecat",
          "pony",
          "porpoise",
          "puma",
          "pussycat",
          "raccoon",
          "reindeer",
          "rhea",
          "scorpion",
          "seahorse",
          "seal",
          "sealion",
          "seasnake",
          "seawasp",
          "skimmer",
          "skua",
          "slowworm",
          "slug",
          "sole",
          "sparrow",
          "squirrel",
          "starfish",
          "stingray",
          "swan",
          "termite",
          "toad",
          "tortoise",
          "tuatara",
          "tuna",
          "vampire",
          "vole",
          "vulture",
          "wallaby",
          "wasp",
          "wolf",
          "worm",
          "wren"
        ],
        "number_of_missing_values": "0"
      },
      {
        "data_type": "nominal",
        "index": "1",
        "is_ignore": "false",
        "is_row_identifier": "false",
        "is_target": "false",
        "name": "hair",
        "nominal_value": [
          "false",
          "true"
        ],
        "number_of_missing_values": "0"
      },
      {
        "data_type": "nominal",
        "index": "2",
        "is_ignore": "false",
        "is_row_identifier": "false",
        "is_target": "false",
        "name": "feathers",
        "nominal_value": [
          "false",
          "true"
        ],
        "number_of_missing_values": "0"
      },
      {
        "data_type": "nominal",
        "index": "3",
        "is_ignore": "false",
        "is_row_identifier": "false",
        "is_target": "false",
        "name": "eggs",
        "nominal_value": [
          "false",
          "true"
        ],
        "number_of_missing_values": "0"
      },
      {
        "data_type": "nominal",
        "index": "4",
        "is_ignore": "false",
        "is_row_identifier": "false",
        "is_target": "false",
        "name": "milk",
        "nominal_value": [
          "false",
          "true"
        ],
        "number_of_missing_values": "0"
      },
      {
        "data_type": "nominal",
        "index": "5",
        "is_ignore": "false",
        "is_row_identifier": "false",
        "is_target": "false",
        "name": "airborne",
        "nominal_value": [
          "false",
          "true"
        ],
        "number_of_missing_values": "0"
      },
      {
        "data_type": "nominal",
        "index": "6",
        "is_ignore": "false",
        "is_row_identifier": "false",
        "is_target": "false",
        "name": "aquatic",
        "nominal_value": [
          "false",
          "true"
        ],
        "number_of_missing_values": "0"
      },
      {
        "data_type": "nominal",
        "index": "7",
        "is_ignore": "false",
        "is_row_identifier": "false",
        "is_target": "false",
        "name": "predator",
        "nominal_value": [
          "false",
          "true"
        ],
        "number_of_missing_values": "0"
      },
      {
        "data_type": "nominal",
        "index": "8",
        "is_ignore": "false",
        "is_row_identifier": "false",
        "is_target": "false",
        "name": "toothed",
        "nominal_value": [
          "false",
          "true"
        ],
        "number_of_missing_values": "0"
      },
      {
        "data_type": "nominal",
        "index": "9",
        "is_ignore": "false",
        "is_row_identifier": "false",
        "is_target": "false",
        "name": "backbone",
        "nominal_value": [
          "false",
          "true"
        ],
        "number_of_missing_values": "0"
      },
      {
        "data_type": "nominal",
        "index": "10",
        "is_ignore": "false",
        "is_row_identifier": "false",
        "is_target": "false",
        "name": "breathes",
        "nominal_value": [
          "false",
          "true"
        ],
        "number_of_missing_values": "0"
      },
      {
        "data_type": "nominal",
        "index": "11",
        "is_ignore": "false",
        "is_row_identifier": "false",
        "is_target": "false",
        "name": "venomous",
        "nominal_value": [
          "false",
          "true"
        ],
        "number_of_missing_values": "0"
      },
      {
        "data_type": "nominal",
        "index": "12",
        "is_ignore": "false",
        "is_row_identifier": "false",
        "is_target": "false",
        "name": "fins",
        "nominal_value": [
          "false",
          "true"
        ],
        "number_of_missing_values": "0"
      },
      {
        "data_type": "numeric",
        "index": "13",
        "is_ignore": "false",
        "is_row_identifier": "false",
        "is_target": "false",
        "name": "legs",
        "number_of_missing_values": "0"
      },
      {
        "data_type": "nominal",
        "index": "14",
        "is_ignore": "false",
        "is_row_identifier": "false",
        "is_target": "false",
        "name": "tail",
        "nominal_value": [
          "false",
          "true"
        ],
        "number_of_missing_values": "0"
      },
      {
        "data_type": "nominal",
        "index": "15",
        "is_ignore": "false",
        "is_row_identifier": "false",
        "is_target": "false",
        "name": "domestic",
        "nominal_value": [
          "false",
          "true"
        ],
        "number_of_missing_values": "0"
      },
      {
        "data_type": "nominal",
        "index": "16",
        "is_ignore": "false",
        "is_row_identifier": "false",
        "is_target": "false",
        "name": "catsize",
        "nominal_value": [
          "false",
          "true"
        ],
        "number_of_missing_values": "0"
      },
      {
        "data_type": "nominal",
        "index": "17",
        "is_ignore": "false",
        "is_row_identifier": "false",
        "is_target": "true",
        "name": "type",
        "nominal_value": [
          "amphibian",
          "bird",
          "fish",
          "insect",
          "invertebrate",
          "mammal",
          "reptile"
        ],
        "number_of_missing_values": "0"
      }
    ]
  }
}