"oz1","oz2","oz3","oz4","oz5","oz6"
-9.8563565e-001,5.8884182e-002,2.4569786e-001,-1.2073457e+000,1.1359881e+000,-9.8798700e-001
-1.6883205e+000,-1.2283675e+000,3.3455854e-001,1.0736577e+000,4.0952554e-001,-5.5983007e-001
1.3275324e+000,-1.3912010e+000,-4.9545740e-001,-4.4160040e-001,6.5807149e-002,-1.0354858e+000
1.2722980e+000,-1.1703036e+000,-1.9211178e-001,5.7813678e-001,-1.3831245e+000,-7.6104878e-001
-3.4787724e-001,1.3156201e+000,1.4948019e+000,-1.0102393e+000,-1.2681050e+000,1.4213217e-001
-1.3081093e+000,-1.3874258e+000,-9.7174859e-001,-4.8382137e-001,4.5139367e-002,-1.2865622e+000
-7.4870691e-004,6.8476107e-001,-9.2049740e-002,9.5891572e-002,1.3989486e+000,6.9129035e-001
1.9658030e-001,6.1876425e-001,1.4875395e+000,-1.2980511e+000,-2.3618252e-001,1.6733317e-002
1.6133017e+000,5.4160748e-001,-4.0264167e-002,1.2934772e+000,-8.0721951e-002,9.6540094e-001
9.8080490e-001,-3.4946507e-001,-1.0762730e+000,-2.7185178e-002,-6.6868038e-001,5.9970081e-001
-1.1277364e+000,4.1576396e-002,1.7586819e-001,-1.5118133e-001,-6.9282624e-001,-1.1605759e+000
3.3121455e-001,8.6962896e-001,-1.4196434e+000,2.9612247e-001,-7.8262465e-001,9.8848991e-001
7.6623686e-001,6.6630402e-003,-7.9052028e-001,1.4378202e+000,-1.6641273e+000,1.2080941e+000
-3.1951759e-001,1.5707117e+000,4.6987534e-001,-5.2446138e-001,-1.0871135e+000,7.3193298e-002
-1.6060525e+000,-4.1072554e-001,1.2048580e+000,-5.2037939e-001,-8.8216737e-001,-1.4100427e+000
1.2150759e+000,-1.1915307e+000,1.5688403e+000,1.6154092e+000,8.3767001e-001,1.3735957e+000
1.1701725e+000,-9.0601221e-001,-2.7986148e-001,-7.8663092e-001,-1.4270254e+000,-8.2210732e-001
6.7872622e-001,5.9749951e-001,1.1343685e+000,-1.6039693e+000,-1.8723187e-002,1.3040361e-001
4.7944521e-001,-8.8656212e-001,-1.0340713e+000,4.9542905e-001,-4.8209825e-001,-2.4751371e-001
4.5006256e-001,-5.0701514e-001,-1.5387128e+000,-1.6596713e+000,-3.9987089e-001,-7.8647340e-001
-7.3491452e-001,-6.4044443e-001,-3.6184390e-001,1.5429614e-001,-4.0373996e-001,-9.3654572e-001
7.1988450e-001,-8.9215942e-001,1.6639848e+000,6.5010671e-001,-6.1414082e-001,6.7065081e-001
6.6564819e-001,2.2571881e-001,-1.6540133e+000,-1.2640514e+000,2.0835002e-001,9.4417246e-001
-5.7871173e-001,1.4100673e+000,8.3859155e-001,4.1463027e-001,-1.0859763e+000,4.2914448e-001
-8.2415076e-001,-4.5448351e-001,8.6525835e-001,-5.0490352e-001,-8.7473330e-001,-1.3413341e+000
9.6688819e-001,-9.9393173e-001,1.5410310e+000,4.8520986e-001,-1.2088042e+000,3.5839761e-001
-1.7357305e+000,-1.5680561e+000,-1.3738328e+000,-1.2827711e+000,-1.1879435e+000,-1.3280339e+000
-5.2613200e-001,-5.0053991e-001,1.7028326e+000,-5.0620859e-002,-1.2593778e+000,9.9402603e-002
1.2258704e+000,3.4958435e-001,-4.4958915e-002,1.6594106e+000,-5.7153879e-001,1.2215154e+000
5.6367948e-002,-6.9658487e-002,-1.4060413e-001,5.5713174e-001,2.8550819e-003,2.4510653e-001
2.3719866e-001,1.0456783e+000,3.7374856e-001,1.1459717e+000,-6.1178059e-001,1.1065744e+000
-1.0026368e+000,2.7607079e-001,-2.8686934e-001,2.4073620e-002,-1.2271161e+000,-8.8438768e-001
-1.5002547e-001,-1.1027592e+000,-8.8878761e-001,-1.1591733e+000,-2.2961888e-001,-1.3582360e+000
-1.5435964e-001,-4.7975197e-001,-1.3646929e-001,4.8017234e-001,2.4654062e-001,-3.1924655e-001
6.1850101e-001,-8.8540582e-001,-3.1558827e-001,-1.5009353e+000,-1.0433064e+000,-1.3128370e+000
1.1656246e-001,1.5674084e+000,-9.9859853e-001,-1.6273007e+000,9.5769704e-002,-1.3009355e-001
-2.9507610e-001,8.2353466e-001,-6.8413665e-001,-1.3114382e+000,9.0784460e-002,-4.0487238e-002
7.3721493e-001,6.9404737e-001,1.7094545e+000,-6.1159309e-001,1.3304668e+000,1.5425771e+000
-1.3413320e-001,-1.4392457e-001,1.0165542e+000,-4.4700976e-001,1.2789263e+000,5.1258904e-001
1.3403549e+000,1.5812618e+000,-1.0595184e+000,6.0566271e-001,-1.1300846e+000,2.6304353e-002
-8.9289473e-001,-1.2694222e+000,5.8268913e-001,-1.3332944e+000,-9.7794429e-001,-2.2498160e+000
1.0605838e-001,-1.1989356e+000,1.5738226e+000,-3.8823454e-001,-3.7668566e-001,-3.8072903e-001
-1.5001870e+000,1.1164763e+000,-1.8355245e-001,-7.7504698e-001,1.3083709e+000,-9.8682198e-001
5.3741696e-002,1.3599194e+000,-1.2908443e+000,-7.9942149e-001,-1.5417929e+000,1.0651552e-001
1.4027677e+000,7.5520952e-001,-2.8695711e-002,-9.1309010e-001,-1.4062517e+000,-4.4122952e-001
2.6753615e-001,-8.9897382e-001,-1.4804141e+000,-9.8063532e-001,1.2881434e+000,-6.3631598e-002
-1.4417117e+000,6.0837351e-001,-9.7379917e-001,-1.3628778e+000,1.4245555e+000,-8.9830659e-001
-1.1259748e+000,-3.9905650e-001,1.3036741e+000,-1.5657978e-001,8.1091555e-001,-3.8839854e-001
6.0355418e-001,9.6427466e-001,1.5669854e+000,-8.5623239e-002,1.1461018e+000,1.5671878e+000
-1.3283998e+000,-1.3602272e+000,2.8474773e-001,-1.8602876e-001,-1.2338129e+000,-2.0619932e+000
-1.7180570e+000,1.6127038e+000,-2.4706134e-001,3.0168315e-001,8.4803219e-001,-7.5007315e-001
-1.4216315e-002,8.1700965e-001,1.6550628e+000,-2.7569518e-001,8.8255245e-001,1.5057688e+000
-1.6815384e-001,7.5230910e-002,-5.6040063e-001,-3.8957317e-002,-1.5549373e+000,-3.8609188e-002
5.6369064e-001,-1.1269368e+000,6.4051825e-001,-1.5920137e+000,-1.2057007e+000,-1.9172293e+000
1.4595164e+000,-4.9775036e-001,1.0592892e+000,5.3266674e-001,-4.0401661e-001,7.9811969e-001
-1.6847769e+000,4.4593732e-001,1.3486147e+000,9.9878605e-001,1.5135382e-001,-3.1475752e-002
1.4429374e-001,-1.2434558e+000,8.7781530e-001,-6.8374600e-001,1.5583616e-001,-7.8994034e-001
-1.7402113e+000,-1.1738325e+000,-2.9686835e-001,-7.3846774e-001,-9.3516042e-001,-2.4521869e+000
6.0084482e-001,7.6047240e-001,2.1667042e-001,-9.9360710e-001,8.2435634e-001,1.8653701e-002
9.4566092e-001,-1.2273912e+000,1.5837406e+000,-9.4690808e-001,-1.2572421e+000,-1.1091411e+000
-7.3862899e-001,-2.1281684e-001,-1.4831517e-001,-6.0037527e-001,9.3028901e-001,-5.7646237e-001
-7.9557234e-001,1.4447825e+000,-1.4633600e-001,-1.0733177e+000,-1.5927546e+000,-1.5393225e+000
-9.6218558e-002,-1.2796434e+000,-5.5729708e-001,8.8393482e-001,4.9693714e-001,-1.7920329e-002
-1.6554436e+000,9.6409382e-001,-1.2098160e+000,-9.4165925e-001,5.7761062e-002,-1.1834546e+000
1.3330361e+000,-1.2891184e+000,9.4648525e-001,2.0576955e-001,-1.0989965e+000,-4.7640560e-001
5.3556336e-001,5.1166489e-001,1.2404808e+000,9.1241766e-002,-6.5509624e-001,7.2011477e-001
1.4120514e+000,-5.0288977e-001,1.6036133e+000,-1.5510830e+000,-1.1815384e+000,2.1005926e-001
6.8067108e-001,8.8460891e-001,1.0332800e+000,7.9206368e-001,-3.2061921e-001,1.4719665e+000
1.7251842e+000,1.6595572e+000,-1.3995203e+000,-1.1071782e+000,-5.7799889e-001,-9.8065011e-001
1.1157973e+000,-6.6245053e-001,3.7399448e-001,2.7854018e-001,6.9271302e-001,5.4619578e-001
-3.7949835e-001,-1.4723164e+000,2.5721936e-001,7.9042163e-001,9.8073903e-001,-7.1445420e-001
-1.1617331e+000,4.7821319e-001,-6.1066933e-001,-1.7075220e+000,-1.5953748e+000,-2.0691892e+000
1.5788250e+000,-1.1246796e+000,-7.7700951e-001,-1.3893418e+000,-1.0018469e+000,-1.6823280e+000
-4.1254836e-001,-4.6097598e-001,-1.0579117e+000,-1.4655555e+000,-3.9995693e-001,-1.0575691e+000
-1.5840673e+000,1.2627890e+000,-5.3442833e-001,-7.1318085e-001,-1.3536718e+000,-1.7206820e+000
-8.1145490e-001,-1.3960379e+000,-7.8701755e-001,1.3197326e+000,-1.6032511e-001,-4.1751690e-001
1.0384531e+000,1.4268629e+000,1.2499640e-002,9.4993013e-001,1.7657904e+000,1.3571642e+000
1.1696857e+000,-9.9924871e-001,-1.1018726e+000,1.2931537e+000,7.8498538e-001,1.1519812e+000
-1.6483391e-001,1.6807434e+000,1.6208971e+000,5.0023176e-002,-8.5879632e-001,1.2388232e+000
-8.1386330e-001,5.7426659e-001,-9.2374745e-001,1.5052782e+000,3.2804517e-002,8.4160301e-001
2.6480479e-001,1.1414034e+000,-5.9600803e-001,-9.7386378e-001,-1.1353213e+000,-3.7520997e-001
-5.3857759e-002,1.5720060e+000,-2.6692805e-001,-1.0436998e+000,-7.8421025e-001,-3.8724665e-001
-6.6052546e-001,-4.5640295e-001,-1.4748963e+000,1.3107204e+000,7.3553429e-001,9.5172486e-001
7.7483325e-001,-2.1000021e-001,-6.6234456e-001,6.6811517e-001,-1.4212591e-001,5.5814704e-001
1.2179389e-001,-1.5268640e+000,-1.3300224e+000,1.3265325e+000,-1.6697270e+000,-1.6339477e-001
-8.0980670e-001,-1.6947815e-002,-5.8153083e-001,9.4981969e-002,1.6006413e+000,2.6266241e-002
-1.1456425e+000,7.8794538e-001,7.7774347e-001,-1.4744727e+000,1.7704850e+000,-6.5063327e-001
6.0082433e-001,2.4655757e-001,-1.4580025e+000,4.5165079e-001,2.2978478e-001,1.4273430e+000
-8.8532768e-001,-1.6455709e+000,-2.8631612e-001,-3.1234530e-001,1.5676207e+000,-7.9386845e-001
-4.1884790e-001,-1.5093169e+000,5.6742319e-001,-1.0020725e+000,-1.4263334e+000,-2.3817542e+000
-6.6213086e-001,-1.4218863e+000,1.5458647e+000,1.6176650e+000,-1.1561968e+000,-3.4398026e-002
1.7392312e+000,1.4767266e+000,3.9236784e-001,1.3334185e-002,-9.8915022e-001,-1.0542969e+000
-1.3614405e+000,7.9441372e-001,1.2555656e+000,1.6186756e+000,1.6490872e+000,7.7791785e-001
1.5432941e+000,-5.7513442e-001,1.5035831e+000,-1.4491276e+000,-1.0853778e+000,4.3007328e-002
-4.9148903e-001,8.8243047e-001,7.8506675e-001,-1.6579055e+000,-5.7799017e-001,-8.1864328e-001
1.1044219e+000,2.1940762e-001,-1.2820734e-001,-3.9670175e-001,-1.4758589e+000,-6.1246327e-002
1.2998106e-001,9.4446777e-001,-1.3696947e+000,1.5726888e+000,-3.4670945e-001,1.8951873e+000
-9.5255261e-001,-1.9772353e-001,1.0290506e+000,-1.4558570e+000,4.6200053e-001,-1.3472087e+000
1.3567651e+000,-1.5625678e+000,-4.8233912e-003,-1.5070563e+000,3.3721919e-001,-1.9845477e+000
-7.7184949e-001,1.6710790e+000,1.5410499e-001,3.1326352e-001,-6.4889131e-001,-1.8554484e-001
1.0989496e+000,3.8991099e-001,-1.1123666e+000,-8.6239918e-001,1.1659620e-001,8.3502422e-001
-4.9743343e-001,-3.2259620e-001,-2.9468524e-001,8.7560730e-001,-1.6883302e+000,-6.0781533e-001
9.6258934e-001,8.8641454e-001,-1.1328799e+000,4.9903762e-001,1.1789905e+000,1.2698094e+000
-1.6295608e+000,5.2193342e-001,1.6328442e+000,5.9317493e-001,-1.0630737e+000,-3.4942267e-001
1.5497090e+000,7.0557030e-001,-6.6041439e-001,2.5308571e-001,-1.6854148e+000,3.4154045e-001
-8.9350344e-001,-7.2893304e-001,1.2460658e+000,-2.7580797e-001,3.0474761e-001,-6.1047783e-001
-1.3404451e+000,1.5198996e+000,-7.0585940e-001,3.4627153e-002,-1.6355516e+000,-9.7870091e-001
-1.2773123e+000,1.3617363e+000,-1.6516184e+000,-9.7583533e-001,1.2463791e+000,5.1376737e-001
-4.4416812e-002,2.5932752e-001,1.5285611e+000,1.3164659e+000,1.2920665e+000,2.2963549e+000
1.5817800e+000,-8.1761910e-001,5.4418225e-002,-5.8708616e-001,-1.6884309e+000,-6.7245384e-001
-5.4383752e-001,2.7314385e-001,8.7825176e-001,1.6915726e+000,-1.5054835e-001,9.8405950e-001
5.6146490e-001,3.1089497e-001,7.7938671e-001,4.5017196e-001,-4.7256886e-001,6.2617494e-001
-3.5276814e-001,-5.9737419e-001,9.5156826e-001,-5.3080532e-001,-1.4259604e+000,-9.3473001e-001
-1.3182703e+000,1.2431824e+000,8.3888066e-001,1.5349723e+000,-1.5142632e+000,-1.7119323e-001
-1.5550355e+000,-9.1180731e-001,-1.4298979e+000,1.6558505e+000,-8.8969843e-001,3.8734070e-001
2.7132752e-001,8.2610020e-001,-1.6836341e-001,-6.7575121e-001,-2.2947237e-001,3.3149586e-001
-9.3290267e-001,7.7336447e-001,1.0374135e+000,3.0433868e-001,3.1205368e-001,-8.0655860e-002
7.6502270e-001,-5.9505792e-001,-1.0467062e+000,4.6640760e-001,1.7751451e+000,1.2566733e+000
-2.9729047e-001,-1.2791076e+000,1.1392135e+000,1.1608036e-001,9.3218043e-001,-2.0708502e-001
-1.5387578e+000,-1.5784939e+000,-4.2475366e-002,1.5973082e+000,-1.3100680e+000,-2.1576460e-001
1.0724240e+000,5.9086962e-001,-1.2887021e+000,1.5701701e+000,1.5712710e+000,2.3389998e+000
-4.4248692e-001,1.5948926e-001,-1.0670572e+000,-1.2251496e+000,1.2340634e+000,-3.2730417e-001
-4.7486898e-001,-1.4775733e+000,1.6503160e-001,-1.0687956e+000,-1.5097291e-001,-1.8300428e+000
1.7286856e+000,1.4396154e+000,1.2900648e+000,1.0441727e+000,-1.3655570e+000,-1.3035202e-001
-1.3181187e+000,4.2125077e-001,1.6334671e+000,-3.0851524e-001,-1.4844802e+000,-7.1099365e-001
-9.5687366e-001,1.5771600e+000,-1.2701480e+000,1.5000906e+000,-1.0365411e+000,1.1926097e+000
1.4147937e+000,7.0080918e-001,-3.5036220e-001,-6.0872198e-001,1.4590280e+000,3.3296655e-001
-1.5372273e+000,-1.6562659e+000,-1.5293783e-001,-1.1328577e+000,3.0396349e-001,-1.9934100e+000
7.5804342e-001,-5.0389423e-001,-1.6052989e+000,1.5610723e+000,6.2764209e-001,2.0106979e+000
-1.7105234e+000,-5.9039494e-001,-1.3264838e+000,-4.5836285e-001,1.2489332e+000,-3.6533477e-001
-8.2306515e-001,-2.5085605e-001,6.8779290e-001,2.1418234e-001,1.3861755e+000,3.1142665e-001
4.8089753e-001,-6.0154297e-001,1.3977225e+000,2.7242845e-001,-1.3055294e+000,2.5897565e-001
1.0290316e+000,-1.1355228e+000,-1.1858107e+000,-9.4605616e-001,7.9561755e-001,-3.9236073e-001
-9.1686411e-002,1.0615523e+000,1.3448849e+000,1.1639763e+000,1.2684726e+000,2.0323563e+000
-2.7043728e-001,-9.9951136e-001,4.6180316e-001,-1.3030610e+000,3.1803643e-002,-1.3900785e+000
-2.4234820e-001,1.5533690e+000,8.3555943e-001,-1.5208323e+000,-1.3128824e+000,-3.4784414e-001
-9.8551531e-001,1.0913581e+000,-1.0419115e+000,-1.4295922e+000,-1.3130420e+000,-9.7671730e-001
5.5054595e-001,-1.3169034e+000,-2.5423878e-001,-1.2988737e+000,1.0016990e-001,-1.6825706e+000
-8.7703186e-001,7.8578450e-002,3.7669220e-002,7.0878973e-001,-7.9971711e-001,-4.1848117e-001
1.3801427e+000,2.8578952e-001,1.7270537e+000,7.5576650e-001,1.2053894e-001,2.0012874e+000
3.2717043e-001,6.8790315e-001,-5.8773995e-001,1.8055291e-001,1.1491532e+000,1.2453875e+000
1.7238363e+000,-1.1037630e+000,1.4621874e-001,-8.6275837e-001,2.9289483e-001,-7.8225392e-001
3.2896906e-001,9.5828549e-001,-5.1760776e-001,-5.0408165e-001,-7.3702061e-001,-4.8223594e-002
-4.6252069e-001,1.7162919e-001,-7.0206045e-001,-3.2798910e-001,-9.2991624e-001,-4.1380104e-001
1.1688340e-001,9.1326885e-001,-1.6884604e+000,-3.8747243e-001,-1.6198933e+000,1.1668310e+000
4.1923047e-001,9.0440748e-001,-1.1870853e+000,1.1015966e+000,7.8278316e-001,1.7734036e+000
-1.1022416e+000,-1.0831743e+000,-1.2745385e+000,6.6636413e-001,-5.9352698e-001,-3.5722633e-001
-8.5359692e-001,-1.4782234e-001,1.7733622e-001,-7.4278340e-001,-5.4785361e-001,-1.3343323e+000
1.2653191e-001,1.5836303e+000,4.5204597e-001,1.4871837e-001,1.6537325e+000,1.3657795e+000
-8.3393391e-002,-1.5360878e+000,1.1655322e+000,6.7067161e-001,-7.5569212e-001,-9.4855530e-001
-5.8730231e-001,-1.5620074e+000,-1.2418562e+000,-1.6183683e+000,-5.7937938e-001,-2.1404946e+000
1.1008922e+000,5.8533076e-001,1.3130360e+000,-8.0301948e-001,-8.1244192e-002,7.3410970e-001
4.8580740e-001,5.1816825e-001,-1.1330893e+000,-3.2683104e-001,7.4187074e-001,1.2738882e+000
-1.1828351e+000,8.0548388e-001,1.2934758e-001,1.3213386e+000,-1.7047847e+000,-4.9597492e-001
-4.0998602e-001,5.3050895e-001,-9.0132697e-001,-6.8188862e-001,1.3981120e+000,3.2193517e-001
-1.3055037e-001,-3.6608000e-001,-7.0783993e-001,3.0889436e-001,-1.9616711e-001,-1.9644517e-001
1.4534355e+000,-1.3552055e-001,7.7677345e-001,-1.7125451e+000,-1.4396101e+000,-4.3693853e-001
9.4053866e-001,-4.4363298e-001,-3.3405352e-001,1.8760923e-001,-8.6322701e-001,-1.3068052e-002
1.2914042e+000,7.6050444e-001,-3.3223019e-001,7.7285367e-002,-1.0596676e-001,5.5766506e-001
6.4870533e-001,-1.2292552e+000,-3.4746037e-001,-1.2407751e+000,1.8202703e-001,-1.4801556e+000
-7.9329244e-002,-1.1498042e+000,-1.4515577e+000,-1.1192282e+000,-1.4308069e+000,-9.8648507e-001
-1.5870032e+000,6.0142421e-001,-1.2585938e+000,7.4943609e-001,1.1399935e-001,-3.6310912e-001
6.9600316e-001,-1.2812220e+000,-4.4610911e-001,7.5800174e-001,-9.8106102e-001,-6.1610143e-001
-5.4941170e-001,-6.5407629e-001,9.7858914e-001,-8.8872117e-001,-5.2535112e-001,-1.3485584e+000
7.4427506e-001,2.2151123e-001,1.3234977e+000,-1.1535765e+000,-1.5585297e+000,1.8274289e-001
-1.5662301e+000,1.0290555e+000,1.0403923e+000,-1.2948817e+000,1.7057005e+000,-1.0532630e+000
8.0118578e-001,9.3909261e-001,5.3980319e-001,3.0794616e-001,-1.4001343e+000,6.0824779e-001
1.3573094e+000,1.3948707e+000,-1.6755928e+000,1.7184432e+000,3.0020587e-002,1.5229348e+000
1.7113990e+000,-5.7913380e-001,1.1837229e+000,1.3916657e+000,-4.5763608e-002,1.4175100e+000
-1.4536112e+000,1.5501940e+000,1.5791884e-001,-4.5081359e-002,1.5323288e+000,-2.9588050e-001
-6.9131665e-002,-8.6964134e-001,1.6591515e+000,-8.0779935e-001,-1.5960668e+000,-7.4215938e-001
-1.6250649e+000,-7.4192802e-001,-3.2698980e-001,1.4594905e+000,8.1543231e-002,-2.9975006e-001
-5.0270346e-001,-1.1850663e-002,4.8715934e-001,-9.7466536e-002,-2.1769422e-002,-4.2278195e-001
1.1530968e+000,1.4833024e+000,1.0648048e+000,-2.1369031e-001,-7.9948364e-001,3.3495384e-002
-2.8749624e-001,1.5507290e-001,1.0168932e+000,1.0073762e+000,1.4620403e+000,1.0216837e+000
1.4543113e+000,-4.2359189e-001,3.7752546e-001,-5.6014326e-001,1.7748100e+000,5.8770863e-001
5.9081867e-001,2.1038612e-001,-1.1780999e+000,-8.5407993e-002,1.6304047e+000,1.4300528e+000
3.0642618e-001,1.5071764e+000,7.2905902e-001,-1.5257838e+000,-3.9145509e-001,-4.7948246e-001
-1.5332568e+000,1.5251967e+000,9.5365683e-001,-7.4242816e-001,1.4261952e+000,-6.2331707e-001
4.3519271e-001,1.4475294e+000,1.8140637e-001,-4.5484660e-001,1.0754485e+000,4.0331988e-001
1.4836811e+000,5.8751285e-001,-4.8564997e-002,5.0148081e-001,2.7266277e-002,1.1976788e+000
1.0139757e+000,-7.5260124e-001,1.8336717e-001,-1.5719479e+000,-1.0487784e+000,-1.2222224e+000
1.3286559e+000,7.7140628e-001,3.1757331e-001,1.4016379e-001,4.5219902e-001,8.7749768e-001
-3.9515393e-002,1.0526449e+000,-3.3673594e-001,1.6176435e+000,-1.0573667e-001,1.5455567e+000
1.3660271e+000,1.4271193e+000,-4.4990548e-001,1.1332263e+000,-9.2624523e-001,1.7042642e-001
-1.4111866e+000,7.6023247e-002,5.1692217e-001,1.8856290e-001,-1.1335737e+000,-1.1831868e+000
1.6064552e+000,-6.0679898e-001,-7.9757472e-001,-3.8990853e-001,-1.1297738e+000,-6.8693430e-002
-1.2553300e+000,-1.0221403e+000,3.4399840e-001,-1.2623218e+000,1.5788238e+000,-1.6301596e+000
-6.7433106e-001,7.0831581e-002,1.8553901e-001,-2.4929353e-001,1.2484012e+000,1.9748496e-002
1.1839521e+000,1.2958422e+000,-2.3979368e-001,-1.5883559e+000,-1.1906377e+000,-1.0535674e+000
1.3698177e+000,1.4590253e+000,-1.4391490e+000,-1.3112879e+000,-5.6913095e-001,-6.8453642e-001
-1.4592148e+000,3.1330559e-001,-1.6754239e+000,-1.9901907e-001,4.2557872e-001,-2.3002294e-002
1.5164251e+000,-1.5044190e+000,-4.2517080e-001,5.2166294e-001,1.0734711e+000,-1.7367074e-001
7.8871268e-001,1.7780919e-001,-1.1912779e+000,-3.4305267e-001,-1.4678795e+000,4.9446226e-001
-4.8203046e-001,-1.3379201e+000,1.1156060e+000,-1.1200851e+000,-1.0199778e+000,-1.1595965e+000
3.0287811e-001,7.8890430e-002,-4.7788160e-001,-1.2572772e+000,-8.5725579e-001,-9.9420324e-001
4.3604278e-001,1.0236576e+000,3.2740993e-001,-1.1300677e+000,-3.8260403e-001,1.3393660e-001
3.8945305e-001,1.5271122e+000,1.5782070e+000,-8.8085958e-001,-1.2375785e+000,4.0896373e-001
1.4033711e+000,-1.3620289e+000,-1.4361587e+000,-1.7399624e-001,1.5646555e+000,8.9694134e-002
8.5779913e-001,7.7829077e-001,1.4196362e+000,9.3714399e-001,-6.4006592e-001,1.5853215e+000
2.2888312e-001,-1.1360251e+000,-1.6498054e+000,-1.2406592e+000,-5.5801527e-001,-9.4402292e-001
2.3667869e-001,6.6487304e-001,-4.7841824e-001,1.2529136e+000,-3.4110386e-001,1.4305813e+000
4.2428614e-001,-7.4135348e-001,-1.3183303e-001,1.1756601e+000,1.4022669e-001,5.4489520e-001
1.0726665e+000,-1.3349134e+000,9.3535026e-001,5.5279378e-001,1.0410496e+000,1.1955564e-001
7.1125914e-001,-6.9297039e-001,1.0460251e+000,2.6475660e-001,-2.7765732e-001,2.9853831e-001
1.2204991e+000,1.1605887e-001,-7.4184885e-001,-1.3511743e+000,-7.0861062e-001,-2.9105887e-001
-7.7562012e-001,4.2536307e-002,1.9296078e-001,6.3808944e-001,-6.0641025e-001,-5.8492682e-002
-1.5702828e+000,8.7800893e-001,-1.1181510e+000,-1.8339687e-001,7.9440794e-001,-6.2047082e-001
-9.3916739e-001,7.6355604e-001,1.0009670e+000,-1.4280058e+000,-1.4676083e+000,-1.5611971e+000
8.9500876e-001,4.9645313e-001,-1.4459448e+000,-9.6880324e-002,-7.3053100e-001,1.2003993e+000
-1.2849932e+000,-9.5200311e-001,1.3155250e-002,3.8354285e-001,-1.0632247e+000,-1.0935227e+000
9.0090483e-001,1.2644496e+000,-7.8455891e-001,-5.3232148e-002,-1.4275185e+000,7.0662657e-002
5.7297474e-001,3.2177863e-003,-1.8381629e-001,1.4070625e+000,-1.1594465e-001,1.0422141e+000
7.5755046e-001,-7.4842264e-002,1.9823666e-001,-1.0867974e+000,-1.3026772e+000,-6.6113456e-001
8.9469509e-001,-9.6420207e-001,1.1299660e+000,1.5879743e+000,6.1956150e-001,1.1272690e+000
-1.5197896e+000,-1.0326012e+000,4.4344716e-001,-1.4917216e-002,-1.6867422e+000,-1.8515320e+000
2.2799492e-001,8.3311966e-001,-2.3434114e-001,8.9493193e-001,-9.8466676e-001,5.2805009e-001
-1.2176722e+000,-1.2130515e+000,-1.4199712e-001,1.4266598e+000,-1.5358441e+000,-8.3830911e-001
-3.9637828e-001,-1.0164686e-001,1.6870601e+000,9.5566111e-001,3.9601571e-001,1.3409757e+000
1.1726114e+000,8.7114541e-001,4.1262695e-002,8.7663757e-001,-1.0115452e+000,8.2711741e-001
-1.2217987e+000,9.9730005e-002,1.6321280e+000,9.7842482e-001,1.3003640e+000,9.4036212e-001
-8.5053747e-001,1.5826528e+000,1.0273830e+000,-1.1993759e+000,-8.3809778e-001,-2.0985700e-001
8.7227818e-001,1.4847003e+000,-1.1017097e+000,-6.4051242e-001,1.5444022e-001,1.7838671e-001
-1.0035930e+000,1.4234011e+000,9.6226531e-001,-9.9917652e-001,1.6932050e+000,1.8346517e-001
9.0495968e-001,1.5465357e+000,8.9948256e-001,-6.5774926e-001,-1.0766284e+000,-4.4235080e-001
-8.4850133e-002,-1.0479750e+000,3.5946356e-001,1.3836466e+000,-6.9556873e-001,8.0198180e-002
1.7393093e+000,5.9786807e-003,-1.4091989e+000,1.0141550e+000,7.7141312e-001,2.2430890e+000
-2.8631015e-001,7.6387410e-001,1.6952510e+000,-7.6807462e-001,2.1481312e-001,9.5474044e-001
-5.9354592e-001,-1.5004358e+000,-1.5945532e+000,-1.4838354e+000,1.6365635e+000,-6.5035735e-001
-6.3158903e-001,8.8795664e-001,2.3668694e-001,-9.6957663e-001,4.0105074e-003,-4.2346124e-001
8.5599053e-001,-3.0287968e-001,2.6733657e-001,1.5323364e+000,6.2630988e-001,1.4188136e+000
5.3883442e-001,-5.7539955e-001,-1.6724464e+000,-1.4479641e+000,1.4026959e-001,-2.0457038e-001
-3.2710160e-001,-7.0871608e-001,-1.4149801e+000,6.2069585e-001,9.9899457e-001,6.5618050e-001
9.1657624e-001,-3.6756693e-001,1.3399318e+000,-1.5623588e-001,1.2282127e+000,8.3033361e-001
4.2490029e-001,1.7070249e+000,-1.4067076e+000,1.3570225e+000,-1.4215527e+000,1.7044954e+000
-1.5724678e+000,-3.3618586e-001,5.5502044e-001,-1.6625741e+000,9.4704958e-001,-1.9731970e+000
-1.6375586e+000,1.4519244e+000,5.6507790e-002,-1.4348932e+000,1.5779891e+000,-1.7158997e+000
-1.0667441e+000,-1.4823258e+000,-1.3164451e+000,-1.0458060e+000,-2.4429238e-002,-1.3783556e+000
2.3285678e-001,-4.8243997e-001,5.5831435e-001,-2.8942810e-001,9.5459310e-001,-1.4413120e-001
1.1483247e+000,1.7273730e+000,-6.6636301e-001,1.5818766e+000,-8.4620607e-001,4.6230206e-001
-2.5763771e-001,9.4943789e-001,-1.2621818e+000,1.3307218e+000,1.0359658e+000,2.0848850e+000
3.5919425e-001,1.3972356e+000,-1.4235368e+000,1.2383876e+000,-3.2234643e-001,1.7978297e+000
8.3575490e-001,-1.2722828e+000,1.1608462e+000,-1.4855577e+000,8.6178015e-001,-1.0189863e+000
8.4425797e-001,-7.0089934e-002,9.8967975e-001,-3.7711928e-001,1.4841604e+000,7.6807744e-001
-1.4927469e+000,-8.4643258e-001,7.7647205e-001,3.2246497e-001,1.0490734e+000,-6.2481305e-001
2.8017720e-001,-1.5859288e+000,-9.3247930e-001,1.1308031e+000,1.6886942e+000,-3.9385522e-002
1.3835612e+000,-1.3060886e+000,-4.8788625e-001,-1.5512872e+000,6.3478654e-001,-1.4692902e+000
6.8856626e-001,-3.3674928e-002,-4.6764034e-001,-1.1791739e-001,1.1626903e+000,8.2127263e-001
1.1374506e-001,-1.5495009e+000,-1.3313605e+000,1.4354724e+000,5.2332766e-001,3.0684303e-001
2.2637713e-001,-2.8828972e-002,1.4930627e+000,1.0928913e+000,-4.8799682e-001,1.2856360e+000
4.0525366e-001,6.3374884e-002,-1.1430374e+000,-1.2238613e+000,1.7043216e+000,3.4371630e-001
-1.5160588e+000,5.6208710e-001,1.7018640e+000,-6.9173127e-001,-1.6190788e+000,-6.1149870e-001
-1.4536092e+000,-4.6029302e-001,-3.5002892e-001,-1.0147550e+000,-1.7637980e-001,-1.6816420e+000
1.3647871e+000,-7.5068688e-001,-1.6911979e+000,-1.5295434e+000,3.9738562e-001,4.0711638e-001
-3.9047266e-001,-1.1956405e+000,-1.0216971e+000,1.0658364e+000,-8.7480320e-001,-2.7900917e-001
5.4260558e-001,-3.1490175e-001,1.4846743e-001,-7.7126633e-001,2.9928346e-001,-1.1522862e-001
9.4892407e-001,-6.2582056e-001,1.2811183e+000,-2.2210021e-001,-1.3547383e+000,-2.9489676e-002
1.4211166e-001,6.4459052e-001,-3.1103426e-001,-7.5809743e-001,-1.2345637e+000,-3.5543457e-001
-9.7146453e-001,1.2428618e+000,-4.2577996e-002,1.3498991e-001,-1.6455664e+000,-7.3338139e-001
-3.1841592e-002,-1.0914184e+000,-8.7388228e-001,8.5185569e-002,-1.2176156e+000,-7.9292074e-001
5.6400625e-001,1.0229015e+000,-8.4210860e-001,1.5248712e-001,1.0057366e+000,1.2794237e+000
-1.3976990e+000,1.6641390e+000,1.4648605e+000,-9.4448226e-001,-9.8760140e-001,-1.1836529e+000
5.0374918e-001,-1.1223429e+000,-5.6714532e-001,-1.1174138e+000,-1.6426715e+000,-1.7350169e+000
-1.5896528e+000,-1.4463851e+000,-1.3775584e+000,-9.0780820e-001,-2.7534221e-001,-1.1845793e+000
4.7274657e-001,-3.7887765e-002,-1.8138216e-001,4.6366648e-001,-1.3595754e+000,-1.2334066e-001
2.0675212e-001,9.6978043e-001,-9.8835215e-001,9.3848105e-002,3.1654194e-002,1.3356959e+000
-7.4654109e-001,4.9676096e-001,8.8943035e-001,-1.1308663e+000,-1.5495894e+000,-1.2811297e+000
-1.6238374e+000,1.5407956e+000,-5.0774273e-001,-7.0832632e-001,-1.6250808e+000,-2.1975469e+000
-4.8479406e-001,1.7327082e+000,1.4771929e+000,6.1265146e-001,4.8510743e-001,1.7745633e+000
-1.6288023e+000,1.1687870e+000,-3.9999125e-001,-9.8433928e-001,-3.7199341e-001,-1.2617999e+000
-3.4978834e-001,-2.9706706e-001,8.9729065e-001,-6.9118629e-001,-3.0096847e-001,-7.0317893e-001
-3.8404581e-002,-1.6463932e+000,5.8640555e-001,1.5840198e+000,4.4292956e-001,2.3392158e-002
-1.6066715e+000,1.4979605e+000,-9.2607977e-001,1.7085004e+000,1.5400822e+000,2.3177949e-001
-1.3834495e+000,-4.4927434e-001,-5.4414977e-001,-9.9653904e-001,-1.5242430e-001,-1.7123714e+000
1.0643300e+000,1.0518150e+000,-1.6649401e+000,1.1762315e+000,-4.6057499e-001,2.2904258e+000
-3.2662495e-001,-1.3009390e+000,-1.6839848e+000,-1.3429662e-001,9.8196235e-001,1.5438063e-001
-3.1163099e-001,-1.6028109e+000,1.2068283e+000,1.1474794e+000,1.0991835e+000,3.0039632e-001
5.6420153e-001,-7.0412070e-001,1.4110393e+000,-5.5399530e-001,6.6825510e-001,4.0555207e-001
-1.2319386e-002,6.3237877e-001,5.2095975e-001,1.2790592e+000,-1.6995490e+000,3.8093837e-001
4.3528689e-001,-4.3628878e-001,3.3788789e-001,-9.4751655e-001,5.8733173e-002,-5.1582171e-001
1.0445128e+000,-1.0143292e+000,7.0961490e-001,1.4838629e+000,1.5826595e+000,8.7047315e-001
2.0685233e-001,9.1067142e-001,-1.2375577e+000,-3.9976271e-001,-5.4453331e-001,3.2501879e-001
6.1052264e-001,1.0208789e+000,-9.1552463e-002,-1.1317105e+000,4.6289795e-001,1.2666931e-001
-2.9903519e-001,1.4154886e+000,4.2942960e-001,-2.2255396e-001,1.2324126e+000,1.0318968e+000
-2.3345126e-001,7.3357837e-002,1.8508362e-001,-6.6017411e-001,6.0048501e-002,-4.7144861e-001
1.9208203e-001,1.0340791e+000,-1.5516336e+000,-1.1810779e+000,-4.4500624e-001,5.6774583e-001
-5.2031311e-001,4.5295961e-001,1.5174076e+000,-1.0816452e+000,-9.6518408e-001,-1.8808509e-001
4.7146000e-001,-5.6527621e-001,4.6765918e-001,1.5089557e+000,5.9572221e-001,9.0283682e-001
-1.2005533e+000,-4.4907955e-001,1.3151078e+000,1.4228273e+000,1.4969622e+000,3.6864469e-001
-1.4930901e+000,-6.0736118e-001,7.1121540e-001,-2.2306475e-001,2.4973746e-001,-1.5091187e+000
-9.6518231e-002,1.1048666e+000,1.9725270e-001,9.2571173e-001,4.1165363e-001,1.0099738e+000
-1.6184376e+000,8.5694047e-001,1.5289983e+000,-9.7536485e-002,1.4699997e+000,-3.3483326e-001
-1.0591821e+000,-1.1429506e+000,-1.6602218e-001,5.6622391e-001,6.3865264e-001,-4.1324883e-001
-5.4593428e-001,1.2782537e+000,-4.7995979e-001,-1.0806618e+000,-8.8563907e-001,-8.4956412e-001
2.9796076e-001,-8.7099135e-001,1.6459339e+000,6.2236226e-001,9.0390530e-001,1.2212475e+000
-1.1166642e+000,-8.5754551e-001,-1.1965643e+000,1.2298727e+000,5.8078388e-001,2.0627819e-001
-9.5510610e-001,-1.0878080e+000,-1.6720242e-001,-1.3374304e+000,-8.5686680e-001,-2.3488857e+000
-1.8509498e-001,-7.8213692e-001,-7.1685782e-001,3.2584767e-002,8.6570242e-002,-2.9559109e-001
-1.4366523e+000,2.0152874e-001,-7.7971326e-002,-5.1566576e-001,-5.7893685e-001,-1.3718346e+000
6.5459346e-001,8.6962904e-001,2.7351096e-001,-9.4615395e-001,6.4950707e-002,-1.0892281e-001
-1.4195367e+000,7.0125973e-001,-1.3488581e-002,1.0016551e+000,-3.4673202e-001,-1.0469687e+000
-1.0195415e+000,1.7297780e+000,1.9955851e-001,-5.5070977e-002,-1.1424744e+000,-1.7272194e-001
1.0818619e+000,1.1759680e+000,1.6928985e+000,-6.8764397e-001,-1.4430458e+000,6.7118198e-001
6.9180427e-001,5.1204062e-002,-1.3450253e+000,-6.8004677e-002,8.2508492e-001,1.1128106e+000
-4.7905514e-001,1.0258415e+000,-1.7486554e-001,1.6982569e+000,-1.5253697e+000,7.1319344e-001
2.1384228e-002,-1.1043322e+000,1.3620176e+000,-7.9919403e-001,-1.1045800e+000,-6.1663369e-001
8.4566397e-001,8.7588730e-001,-1.6140165e+000,6.1952934e-001,1.1796672e+000,2.4107108e+000
-7.6621670e-001,-1.5320485e+000,1.4300982e+000,-1.6026922e+000,4.6531301e-001,-1.1976025e+000
-3.7674296e-001,1.5576089e+000,-8.2225078e-001,1.5272446e+000,1.7130720e+000,2.1918026e+000
9.1748042e-001,-2.3541209e-001,1.0929282e+000,6.5304779e-001,-1.1777864e-002,9.7294530e-001
8.0387639e-001,2.2032102e-001,-6.8343857e-001,3.8402643e-001,1.5617445e+000,1.2115501e+000
-6.4356773e-001,-1.5252616e+000,6.3406977e-001,1.3241601e+000,-1.0870311e+000,-5.9568061e-001
-5.4337648e-001,-6.4341103e-001,-2.8426997e-001,6.7607003e-001,-1.5616199e+000,-8.7929814e-001
2.7215953e-001,4.5844423e-001,4.8836079e-001,-1.1847994e+000,-1.4392412e+000,-1.2747350e-001
-1.0013859e+000,-1.4919916e+000,-8.6637576e-001,1.2604024e+000,-3.0290962e-002,-2.0797391e-001
1.4216888e-001,-8.9783042e-002,-5.8773023e-001,-5.9098412e-001,-1.0730700e+000,-8.7585641e-001
-1.0341340e+000,1.1684370e+000,9.8836196e-001,-1.0780742e+000,1.5600155e+000,3.0622533e-002
1.4544009e+000,1.6720631e+000,5.9196028e-001,7.8204546e-001,-6.8805799e-001,-6.6005056e-001
6.6619567e-001,-1.4548037e+000,-6.1784217e-001,-7.5132454e-001,-5.6484711e-001,-1.2748176e+000
-1.0864102e+000,1.3067708e+000,-9.1015996e-001,-1.5251732e+000,-2.2650457e-002,-1.4625098e+000
-8.8312040e-001,1.7290392e+000,1.6655234e+000,-1.8439148e-001,1.4052631e+000,1.0848376e+000
5.0497458e-001,-7.2430665e-001,-1.5323710e+000,1.0493020e-001,1.4482704e+000,1.0807007e+000
-6.9136066e-001,1.7077241e+000,-3.1853622e-001,-1.6250879e+000,-1.2739132e+000,-7.3434762e-001
-1.0680650e+000,2.6778336e-001,-8.2260659e-001,7.0187372e-001,1.0082730e+000,2.0108820e-001
9.3968937e-001,8.6593030e-002,-1.5121871e+000,1.4868723e+000,-1.2518041e+000,2.0146490e+000
2.6172978e-001,-1.4847026e-001,1.6569388e+000,4.9517954e-001,7.4640058e-001,1.6025526e+000
-5.7367498e-001,-1.0588144e+000,3.8689935e-001,-5.5885611e-001,6.8043425e-001,-1.1009089e+000
-6.3491467e-001,-7.5866387e-001,3.5997799e-001,8.8957527e-001,1.6980524e+000,1.3788171e-001
-1.6805336e+000,-1.5743534e+000,-1.4053915e+000,1.5739703e+000,-1.3484012e-003,-4.9553759e-002
8.0504079e-001,-1.1065116e+000,1.0666272e+000,-4.5548216e-001,-4.3661334e-002,-3.9855261e-001
-1.7095883e+000,-5.9385389e-001,-1.3453633e-001,1.2331398e+000,-4.8594652e-001,-8.0465233e-001
1.0959706e+000,1.0819976e+000,1.6156940e+000,1.1508176e+000,-7.1360704e-001,1.6540735e+000
-9.2098882e-001,3.1795454e-001,-1.2387163e-001,-1.4915608e+000,-7.0059214e-001,-1.3170560e+000
1.0231256e-001,-3.9977708e-001,-1.6799479e+000,-4.6156524e-001,1.3937542e+000,1.3352891e+000
-1.6768535e+000,1.9875657e-001,5.4411698e-002,7.8435805e-001,-1.2865855e+000,-1.3505024e+000
1.3810212e+000,-1.1114992e+000,-1.2854669e+000,-1.3165183e+000,-1.5440858e+000,-8.9959797e-001
-1.2464557e+000,-1.4031998e-001,-1.3518991e+000,-1.0496070e+000,9.1049474e-001,-8.6939593e-001
-1.1909543e+000,-4.6573905e-001,-1.4481465e+000,-1.2272562e+000,1.4489354e+000,-5.8936000e-001
-1.5444171e+000,-1.2166064e+000,1.7359675e-001,-5.9527429e-002,-2.6735876e-001,-1.4277155e+000
-9.8955110e-001,-1.4188899e+000,1.0946904e+000,-5.2345935e-001,1.0969750e+000,-8.3772601e-001
-7.3456253e-001,-1.4310228e+000,-7.7504123e-001,1.3292348e+000,-1.2385763e+000,-5.4735329e-001
1.1129697e+000,-1.2474826e+000,1.6729233e-001,6.2369336e-001,-1.4962928e+000,-9.4396242e-001
-1.5908962e-001,1.5911562e+000,-1.3044012e+000,5.3212181e-001,-6.8974726e-001,1.5470688e+000
9.7414762e-001,-7.5582794e-001,1.0474670e+000,-1.5188480e-002,1.5723264e+000,5.7884044e-001
1.2870856e+000,1.3436520e+000,8.8520612e-001,-2.3455380e-001,1.0671938e+000,1.4429861e-001
-8.9614278e-001,-1.5109823e-001,1.5451130e+000,-1.3196532e+000,1.5222438e+000,-3.4635835e-001
1.6408018e+000,1.2150304e+000,5.2302260e-002,1.3373032e+000,8.5681191e-001,5.5922545e-001
8.4811997e-001,-2.4866326e-001,-3.7225927e-002,1.7009802e+000,-1.9494205e-001,1.2402373e+000
-8.5517072e-001,-1.3579092e+000,-1.5430611e+000,-2.2882348e-002,-1.5589233e+000,-5.7555502e-001
1.4235373e+000,9.2608037e-001,1.2719085e+000,-1.3702025e+000,9.9973946e-001,3.7563204e-001
1.0567840e+000,-7.2725436e-001,-1.9056112e-001,1.3715630e+000,-6.4379355e-001,1.1277856e-001
-5.0073394e-001,-1.0034025e+000,1.4330780e+000,-6.6082075e-001,1.6068085e+000,1.2047732e-002
1.7262852e+000,6.9076802e-001,1.4630158e+000,1.6116803e+000,1.3135487e+000,2.3142299e+000
-1.4988647e+000,2.0701501e-001,-1.4688930e+000,2.1218983e-001,7.8143171e-001,-9.1277958e-002
7.5945071e-001,-4.0944560e-001,-1.3914281e+000,1.4756653e+000,-5.3311518e-001,1.3642919e+000
5.2814028e-001,-7.9724379e-001,1.4667078e+000,6.2202034e-001,5.0447147e-001,1.1676641e+000
1.1564975e+000,1.0214696e+000,1.1314381e+000,9.3143622e-001,1.2358958e+000,2.0557456e+000
-1.1055528e+000,-1.5269182e+000,-1.1392249e+000,-1.5001692e+000,-1.1690531e+000,-2.0611569e+000
2.4513180e-001,2.8272129e-001,1.0522552e-001,-6.8961958e-001,-7.0105938e-001,-3.0484984e-001
-7.5563798e-001,1.1157265e+000,-1.5301549e+000,7.6362466e-001,1.6988202e+000,1.7303452e+000
-5.2625931e-001,7.6816862e-001,-1.5302303e+000,-1.6054421e+000,-1.1235020e+000,-2.5455834e-001
1.3797756e+000,-1.0786337e+000,-1.2888687e+000,-1.1984426e+000,-5.9337725e-001,-8.8359856e-001
-1.3727850e+000,-1.5237853e+000,-3.4013758e-001,1.3757504e+000,-1.9024241e-001,-7.0951876e-001
-1.1940047e+000,1.5819677e+000,1.5426709e+000,-1.0764250e+000,6.5579158e-001,-2.7128414e-001
-4.4276695e-001,-6.3491840e-002,4.8411095e-001,-8.0997752e-001,7.9298247e-002,-1.0354598e+000
-1.6863398e+000,4.0059036e-001,-6.4584086e-001,-1.5298871e+000,-1.3001614e+000,-2.3581114e+000
1.6580285e+000,-8.4735885e-002,-4.8108554e-001,1.2742117e+000,1.8654791e-001,1.4601028e+000
-2.7723781e-001,-6.3778870e-001,9.0404007e-001,-1.6935834e+000,-5.0435402e-001,-1.3985029e+000
-8.6686615e-001,9.8022595e-001,-5.6699340e-001,-1.7053644e+000,7.7220970e-001,-7.6499256e-001
5.1567143e-001,-9.2683654e-001,-1.3598799e+000,1.0596138e+000,1.2030082e+000,1.2555845e+000
-9.7250781e-001,-4.1383650e-001,3.4978789e-001,-1.6459398e+000,-2.5808691e-001,-2.0140369e+000
4.2426244e-001,-1.5689838e+000,-6.8362584e-002,-1.1725044e+000,6.2853438e-001,-1.9090031e+000
-1.2409513e+000,-4.2781755e-001,-1.7240236e-001,5.2336858e-001,1.5363326e+000,-2.6347974e-001
5.8092873e-001,4.4794982e-002,3.0792227e-001,-1.1360807e+000,9.8756658e-001,-5.8519812e-001
9.1307751e-001,9.9420139e-001,-1.6413673e+000,-1.6187789e+000,-1.7031068e+000,3.9919274e-002
2.7013885e-002,2.0522592e-001,1.1926128e-001,1.3014064e+000,7.1953580e-001,1.3496747e+000
4.0071669e-001,2.5207650e-001,9.9774398e-001,-3.3682803e-001,-2.8864138e-001,4.0960259e-001
-1.1932287e+000,-3.5416333e-001,9.1805263e-002,-2.9023238e-001,3.4498713e-001,-1.1185052e+000
-8.5131295e-001,-1.0879726e+000,5.4002923e-001,-1.3471549e+000,3.8520211e-001,-1.7027772e+000
2.8316973e-001,7.5484430e-001,2.2019951e-001,-3.0105483e-001,9.9134205e-001,7.8948443e-001
-6.7023485e-001,3.4019795e-001,-9.8903595e-001,-4.6877526e-001,-1.6327542e+000,-6.2104572e-001
7.6015991e-001,4.9753447e-002,-1.6447411e+000,1.1038260e+000,1.2276998e-001,2.3972421e+000
8.1426174e-001,-1.5972764e+000,-1.2702880e+000,-4.3390287e-002,1.0894661e-001,-7.6039918e-001
1.4628206e+000,-6.0520605e-001,1.5288480e+000,-3.1076866e-001,-2.3322381e-001,1.1427418e+000
1.7343294e+000,-5.4595925e-001,-1.8170432e-002,4.7259478e-002,-1.5924993e-002,6.0579639e-002
-1.7391983e+000,-3.2883150e-001,4.4685591e-001,6.5734774e-001,-7.8424717e-001,-1.1530362e+000
-8.7661506e-001,1.4028407e+000,6.6051780e-001,-4.9619381e-001,-1.4480999e+000,-5.8971727e-001
4.3350185e-002,-1.2465992e+000,-4.3407828e-001,3.0876791e-001,8.5974193e-001,-5.9404393e-001
1.6682074e+000,-8.0229527e-001,5.2880085e-001,-1.1835866e+000,1.5457140e+000,-1.3798671e-002
-1.3969679e+000,-1.7721565e-002,1.2127099e+000,1.5627160e+000,-4.9479331e-001,7.3380262e-002
-1.2836171e+000,8.7587898e-003,-1.2256545e+000,1.0325183e+000,-1.1546744e+000,-1.4952461e-001
-3.5779608e-001,-9.6847068e-001,-1.0930795e+000,1.4603307e+000,6.3505687e-001,8.6684027e-001
-3.0672594e-002,-1.5555407e+000,1.5206494e-001,-1.4173808e-001,7.9623975e-001,-1.1337405e+000
1.1153821e-001,-5.2778335e-001,5.4896602e-001,-1.2839162e+000,1.0116630e+000,-5.8503430e-001
-1.1225234e+000,1.6347142e+000,2.4857890e-001,-6.6595577e-001,-1.8571672e-001,-5.5713654e-001
1.4264069e+000,4.6564823e-001,-1.2574444e+000,-6.9475250e-001,3.5076218e-001,7.1363074e-001
-1.0795981e+000,-1.1749104e+000,-9.1025028e-001,-2.0470138e-001,-7.0637796e-001,-1.4577980e+000
1.2665124e+000,-1.5840628e+000,1.7049039e+000,1.5491079e+000,-1.5434203e+000,1.4326007e-001
-2.6790727e-001,6.6811819e-001,1.6621182e+000,-1.0523978e+000,-1.2838308e+000,1.2088353e-001
-3.2292240e-001,2.3938792e-001,-1.6828739e+000,1.4171158e+000,-8.4314778e-001,9.7144531e-001
-1.4945283e+000,-1.4104921e+000,-9.6340385e-001,-1.6195184e+000,-1.4124930e+000,-2.0967925e+000
9.2019368e-001,2.6950524e-001,1.2692943e+000,1.4755342e+000,-1.2085094e-001,1.7546012e+000
-3.9355611e-001,5.6279799e-001,9.6750343e-001,-1.5048968e+000,-6.3571464e-001,-7.4823053e-001
9.9322634e-001,1.5428333e+000,-4.2845956e-001,1.1388014e+000,3.3085579e-001,1.1713818e+000
-1.5338757e+000,3.2470715e-001,4.7910947e-001,-1.6118298e+000,-1.0501207e+000,-2.1389366e+000
1.2650168e+000,-1.3404138e+000,2.6441503e-001,-1.3650494e+000,8.9983715e-001,-1.3765817e+000
-4.4202571e-001,-1.1923337e+000,5.9495403e-001,-1.5706071e+000,2.8725760e-001,-1.7266260e+000
-9.2171733e-001,6.0177540e-001,1.1337007e+000,3.7907161e-001,4.6944244e-001,4.5206375e-001
-3.9264691e-002,-4.9304884e-001,-1.0013019e+000,1.5951002e+000,7.5917878e-001,1.1426963e+000
-9.9027760e-001,1.7057227e+000,1.1751107e+000,-2.6727072e-001,-1.0889114e+000,-3.4617513e-001
4.5688693e-002,-2.1382595e-001,-1.5296959e+000,1.5788075e+000,1.2072797e+000,1.8169017e+000
-6.0240177e-001,-2.5657995e-001,3.7459054e-001,1.5076579e+000,4.5570903e-001,6.4837692e-001
-1.4106300e+000,1.6263764e-001,2.5010672e-001,-1.1389612e+000,1.0390301e+000,-1.5461228e+000
-5.6911870e-001,-1.0626010e+000,4.0817969e-001,-1.1709394e+000,-1.0718428e+000,-2.0678916e+000
1.4832479e+000,-6.0325887e-001,-8.4992035e-001,-8.1854290e-001,1.1802877e+000,6.0834863e-002
3.6787449e-001,-1.2177385e+000,1.2009203e+000,-2.6041881e-001,5.6826223e-001,-3.7542136e-001
8.6461510e-001,-1.4117982e+000,-3.7370172e-001,-8.1596325e-002,1.2227271e+000,-9.0200251e-001
-3.0535458e-001,3.3721467e-001,1.6082094e+000,-1.2148388e+000,4.0370667e-001,2.6762274e-001
7.5252397e-001,-1.4699176e+000,4.8911631e-001,-1.1317956e+000,1.4608446e+000,-9.0532170e-001
1.3446707e+000,8.3732123e-001,-1.4669429e+000,-3.1136851e-001,6.3697891e-001,1.0614344e+000
-2.8939163e-001,-1.0509591e+000,2.4020766e-001,-2.1529409e-001,2.8777991e-001,-9.4931721e-001
-1.3593738e+000,-6.2096210e-002,-1.6183778e+000,6.9107774e-001,6.2388588e-001,5.9016928e-001
4.0343738e-001,1.2996120e+000,1.3734591e+000,9.2007690e-001,1.6737777e+000,2.1622377e+000
-9.2525741e-001,-7.6323047e-001,-6.6050329e-001,4.5577991e-001,-5.7153365e-001,-6.7511485e-001
-4.3293508e-001,1.5274207e+000,1.6313676e+000,-2.0074160e-001,1.6913117e-001,1.1901379e+000
-1.6096402e+000,1.2395472e+000,-1.5127845e+000,3.0937518e-001,-1.3666338e+000,-5.6667709e-001
-3.1255374e-001,8.0635648e-001,-9.7465804e-001,-4.6777765e-001,1.2451787e+000,6.3299865e-001
2.9802508e-001,-1.5581351e+000,-1.8629155e-001,-1.2269965e+000,-7.0515580e-001,-1.7535712e+000
-5.2230272e-001,-1.0374130e+000,1.0323151e+000,1.4670126e+000,1.4490036e+000,6.3300586e-001
8.8310248e-001,-7.4794216e-001,-1.4410797e+000,-1.2729758e+000,-8.2646325e-001,-6.3335281e-001
-1.3152306e+000,1.6011020e-002,-1.2040388e+000,1.1866109e+000,-3.3403082e-001,-2.0452353e-001
7.4346395e-001,-1.1414915e+000,-1.2083095e+000,-8.3619491e-001,5.1748719e-001,-5.0163808e-001
1.0055833e+000,-1.4103530e+000,6.8121651e-001,-9.7318512e-001,-1.5952315e+000,-1.7846532e+000
1.0809863e+000,-1.4572882e+000,-2.6109096e-001,7.4467910e-001,-1.3206115e+000,-8.7808373e-001
6.9472855e-001,-1.4877300e+000,1.0934852e+000,3.0637565e-001,4.7774149e-001,-4.5782996e-001
1.5457970e+000,2.8763617e-001,-1.0481526e+000,-8.7556619e-001,1.8760411e-001,6.3983942e-001
-1.3816842e+000,1.4822875e+000,-8.6281549e-001,-1.6262402e+000,-2.4909741e-001,-1.3617329e+000
7.2965423e-002,-8.2829781e-001,1.6318288e+000,-1.6109673e+000,-7.8286026e-001,-7.0337442e-001
-1.7061648e+000,-7.7528110e-001,-3.0478315e-001,6.0957851e-001,1.5420937e+000,-5.8047587e-001
1.4942414e+000,-2.3103468e-002,3.8191226e-001,-1.6115594e+000,1.2404314e+000,-5.2745468e-002
8.0566209e-002,-1.6578694e+000,-1.1855920e+000,-7.2249098e-001,-4.0058786e-001,-1.2415024e+000
-9.3394775e-001,1.3624816e-001,2.6468887e-001,9.0541744e-001,1.3195231e+000,2.1094827e-001
-1.4875076e-001,-5.6026725e-001,4.4414217e-001,-1.1490285e-001,2.6443260e-001,-6.7627508e-001
7.7912348e-001,-1.3728623e+000,8.2304540e-001,-1.6019693e+000,1.2770754e+000,-1.4704143e+000
2.8027501e-001,-6.3941530e-001,1.1047018e+000,2.6141552e-001,-3.1733675e-001,3.2242379e-001
2.7536075e-001,1.1305621e+000,7.9486934e-001,9.2156421e-001,-3.4735589e-001,1.4072323e+000
1.1558149e-001,-3.1344742e-001,1.4676147e+000,-2.8926263e-001,-1.4976875e+000,-1.3290209e-002
-1.0398251e+000,1.3383112e+000,4.7506935e-001,1.2270209e+000,5.2804973e-001,8.4294860e-001
-1.7194427e+000,-4.8476338e-001,-1.1192608e+000,-1.4241197e+000,7.3400061e-001,-1.5935036e+000
8.3808375e-001,-1.7673423e-002,-1.1618746e+000,-6.5758313e-001,1.5464754e+000,4.3122270e-001
6.1157738e-001,-1.5361065e+000,-1.5815082e+000,6.6696807e-002,-5.3713953e-001,-4.3188157e-001
-4.8100053e-001,7.2126531e-001,-1.4967303e+000,1.9164332e-001,-6.6722993e-002,1.0360971e+000
6.3349901e-001,-3.0027743e-001,-1.4328676e+000,1.7162325e+000,-9.9367974e-001,1.3342832e+000
3.2586650e-001,-9.1189452e-001,5.1158742e-001,-1.2422116e-002,-9.9196259e-001,-9.6070973e-001
1.6038810e+000,-1.1878906e+000,-1.1830164e+000,-9.0158333e-001,-8.6616415e-001,-6.1427994e-001
1.3313766e+000,1.9535134e-001,-1.5135209e+000,-1.0577462e-001,-9.2465336e-001,1.1680490e+000
2.8937050e-002,-1.5829753e+000,1.4151227e-001,1.0265399e+000,1.5573475e+000,1.2767349e-001
5.4228534e-001,1.2086644e+000,8.8659302e-001,-1.6829521e+000,-1.4480581e+000,-5.6333643e-001
1.0586818e+000,-1.1765174e+000,1.2926894e+000,3.9896898e-001,-4.9621265e-001,9.6679958e-002
-5.2485161e-001,5.4300726e-001,1.3384999e+000,6.3536367e-001,6.6557624e-001,1.1289985e+000
-1.1759177e+000,-8.4940492e-002,4.7283117e-002,-1.0958129e+000,-2.2219643e-001,-1.5527742e+000
5.9827305e-001,-1.1984775e-002,-8.3442134e-001,4.1897059e-001,5.4527889e-001,7.4253520e-001
-1.4682017e+000,-1.0913107e-001,1.5331777e+000,1.5694129e+000,5.7857706e-001,9.7281627e-001
-1.2535326e+000,-1.3102083e+000,1.0947812e+000,1.5428846e+000,6.9689295e-001,2.4384946e-001
-1.9761400e-001,-1.2220566e+000,-8.9828206e-001,-6.6482729e-001,1.2321529e+000,-7.1847485e-001
8.5639159e-001,1.3417912e+000,-4.1046981e-001,1.3690874e+000,-1.1401477e-001,1.4089883e+000
-1.5516738e+000,7.5114459e-001,-1.6602509e-001,-1.0219644e+000,-6.9557273e-001,-2.0216466e+000
1.4255339e+000,4.2932881e-001,5.1828232e-001,1.3956510e+000,1.0816778e+000,1.6398027e+000
-2.0463414e-001,-1.0295768e+000,5.9725694e-001,-1.6482252e+000,-1.2919006e+000,-1.8732089e+000
-3.8859539e-001,-9.1315250e-001,-1.4184526e+000,2.4735156e-001,-6.4883309e-001,-1.0337492e-001
1.5154874e+000,-1.3913224e+000,1.2020555e+000,7.4605706e-001,-2.8669154e-002,3.1195798e-001
1.7276542e+000,-1.1281988e+000,7.6354815e-002,5.4646640e-001,-4.2093964e-001,-9.4814685e-002
-2.1861948e-001,1.7036650e-002,-1.4821706e+000,1.3355642e+000,-1.2448496e+000,8.8421965e-001
1.5942662e+000,-1.5366665e+000,9.5087278e-001,-7.0448451e-001,1.5619731e+000,-8.2350979e-001
6.3333416e-001,5.2858806e-001,-1.0179275e+000,1.3009065e-001,-1.1312866e+000,6.7168939e-001
-9.0201513e-001,1.2937858e+000,7.3097681e-001,3.0943198e-001,-4.0044367e-001,3.4122636e-001
6.7228134e-001,9.7898720e-001,-1.7034000e+000,-1.3921464e+000,-2.1897776e-001,5.8504560e-001
2.7147216e-001,1.4103311e+000,-6.6028235e-001,1.1505772e-001,-1.3649876e+000,6.5481545e-001
2.0606197e-001,-1.2960772e+000,-7.7598875e-001,-6.3432695e-001,-1.4441038e+000,-1.1680795e+000
7.4702875e-001,4.1148302e-002,4.1403509e-001,-7.5906850e-001,1.4911848e+000,-1.2881435e-001
1.5141150e+000,-1.3127940e+000,-1.0528415e+000,4.5380600e-002,1.0705992e+000,8.8694861e-002
1.5632848e+000,-1.6427437e+000,1.5522235e+000,-8.2817711e-001,-1.1889051e+000,-1.1366399e+000
-2.1965284e-001,-1.0769003e+000,1.0161297e+000,-7.2032518e-001,-1.0685055e+000,-1.1897921e+000
8.2104504e-001,-1.0739463e+000,-1.5867190e+000,1.0287244e+000,-2.9077486e-001,8.7944269e-001
1.1329833e+000,4.2786521e-001,-5.0141314e-001,-4.1635761e-001,-1.3962817e+000,4.9326258e-002
-1.4006199e+000,5.8813452e-001,1.6891625e+000,2.4166030e-001,-9.1753991e-001,-3.5433554e-001
5.8482617e-001,-9.2282171e-001,-2.5363111e-002,-1.0620949e+000,1.5714984e+000,-4.3377334e-001
1.2326782e+000,-2.7905125e-001,1.1390402e+000,-7.6979855e-002,6.6784207e-001,9.1956936e-001
-1.6504380e+000,-8.6515808e-002,1.2301872e-001,-2.6705776e-002,1.1894318e+000,-5.7499567e-001
1.5506247e+000,5.3637528e-001,-1.1622175e-001,-1.1343984e+000,-2.9506885e-001,-1.5717173e-001
6.6343319e-002,6.4255838e-001,-1.0104232e-001,4.4208885e-001,-1.1795641e+000,-1.8044762e-001
-7.8464254e-001,-9.3639201e-001,9.6042105e-001,6.4898149e-001,1.5139519e+000,9.4606603e-002
2.3829667e-001,-1.1559050e+000,1.1407705e+000,1.3373398e+000,5.0103861e-001,3.6813439e-001
1.1811017e+000,-8.8244874e-001,1.1201651e+000,-3.8202181e-001,1.1500163e+000,1.2735563e-001
1.5203557e+000,-4.0188656e-001,1.4082719e+000,1.6738211e+000,-7.4793004e-002,1.9064402e+000
-2.1394050e-001,5.5931645e-001,-1.2874109e+000,1.4833244e+000,2.1747266e-002,1.5807450e+000
-1.3421184e+000,9.2169356e-001,-2.6335787e-001,1.0086808e+000,3.5037953e-001,-1.3920900e-001
-1.0416349e+000,1.2876832e+000,-1.0596264e+000,7.4362904e-001,4.0124559e-001,4.5738588e-001
1.0157527e+000,4.0959685e-001,-5.1342879e-001,3.9644855e-001,-7.8494768e-002,9.8203390e-001
8.7969052e-002,-1.5337612e+000,1.6210352e-001,7.1433589e-001,1.4243328e+000,-3.3497497e-001
-1.5963240e+000,-7.5744584e-001,-1.1333053e+000,3.1933721e-001,-1.0776050e+000,-9.2621960e-001
6.5323816e-002,5.7380639e-001,-1.0974388e+000,-3.3880939e-001,-1.1596138e+000,-1.0804067e-001
-6.2546015e-001,-2.2281046e-001,2.5987857e-001,-8.0797972e-001,5.8970592e-001,-1.0911781e+000
1.5236117e-001,-2.8620861e-001,3.2060209e-001,8.9888307e-001,6.6591928e-001,6.0877282e-001
-1.6780897e+000,-3.9462906e-002,2.3941891e-001,1.5640093e+000,-4.9709600e-002,-4.8120098e-001
-1.7264679e+000,-1.3950843e+000,-8.9838388e-001,2.9682249e-001,1.5030784e+000,-5.7452891e-001
-1.6381714e+000,4.4226164e-001,-1.3086964e+000,-1.2347230e+000,1.7815780e-001,-1.1059581e+000
3.1269138e-001,1.3424840e+000,3.4629087e-001,-8.7384170e-001,-4.5137953e-001,-1.3367682e-001
-7.4193970e-002,1.1949971e+000,1.0541799e+000,-1.4630468e-001,1.6384676e+000,1.0137034e+000
1.3881344e+000,3.6389445e-001,-5.6638134e-002,-2.5592151e-001,2.9704288e-001,5.2423178e-001
-1.6218240e+000,3.3306118e-001,-4.7210318e-001,8.0687938e-001,1.5652658e-001,-8.6370978e-001
-1.3853819e+000,-1.0442045e+000,-1.2026121e+000,-4.3333547e-001,6.0284102e-001,-8.6710641e-001
1.6513915e+000,-9.7378504e-002,-1.2194247e+000,-2.6912147e-001,1.4308994e+000,1.2005134e+000
-2.1186124e-001,4.8326247e-001,1.6627761e-001,-1.0783646e+000,1.7082448e+000,7.2375190e-002
-2.2673779e-001,1.7115611e+000,9.2531808e-001,1.4370186e+000,-1.5946084e+000,1.3762071e+000
9.6306331e-001,-1.2711133e+000,1.1060114e+000,-9.5816492e-002,8.0851518e-001,5.2792055e-002
-9.5773652e-001,1.0573605e+000,-1.1185024e+000,3.4888868e-001,-1.0832811e+000,-6.7332812e-002
-3.3830603e-001,-1.2554297e+000,1.6020779e+000,-1.6716136e+000,9.2462171e-001,-8.3556189e-001
1.0922515e+000,1.0076933e+000,-6.6418706e-001,-9.2116837e-002,1.3293009e-001,7.2186093e-001
8.1264715e-001,3.5146291e-001,-1.6288450e+000,-1.2752569e+000,3.7065170e-001,4.9389565e-001
-6.6458987e-001,-3.3503729e-001,5.1454886e-001,-8.7797475e-001,1.6163366e+000,-5.8131431e-001
-1.4610394e+000,-9.1017978e-001,8.5135688e-001,2.9227355e-001,-1.0971567e+000,-1.0776924e+000
1.4333822e-001,4.1516896e-001,-3.3239403e-001,2.0370322e-001,1.3651869e+000,1.0470089e+000
1.3200327e+000,8.5865738e-001,3.4813851e-002,-7.5883774e-001,5.6343790e-001,7.1326276e-002
3.3590673e-001,8.5350888e-001,1.1258790e+000,3.5213614e-001,-1.3303741e+000,7.7020075e-001
-7.1197034e-001,1.5490272e+000,-3.5092464e-001,5.3052630e-001,-1.1428938e+000,1.6110032e-001
1.4077736e+000,4.7965189e-001,-1.0734592e+000,-1.5160401e+000,-7.0921052e-001,-4.0443508e-001
-2.9905211e-001,6.4780112e-001,1.5941084e+000,-2.7914736e-001,8.5196849e-001,1.1148826e+000
-1.1983840e+000,-1.5349333e+000,7.6062485e-001,-6.7713895e-001,1.3136729e-001,-1.4300810e+000
-1.4811492e+000,7.6538581e-001,1.5410114e+000,8.0361598e-001,6.5130643e-001,1.5526967e-001
-1.3343712e+000,-8.0277816e-001,1.1663709e+000,1.5919803e+000,-1.1575411e+000,-2.0568123e-002
4.9923565e-001,-4.2850304e-001,-6.7471266e-002,-2.8871027e-001,-1.0492195e+000,-2.6959140e-001
-2.0055742e-001,-3.1106204e-002,5.9481484e-001,-4.0282545e-001,3.0510534e-001,-1.5737899e-001
-1.6165664e+000,-8.4334086e-001,-2.6631366e-001,1.7077349e-002,1.3077691e+000,-8.4970662e-001
5.8704608e-001,2.7310288e-001,-2.0563527e-001,3.2889639e-001,-8.8939555e-003,6.7672760e-001
1.5763612e+000,-1.2482615e+000,-4.4790542e-001,1.0404936e+000,-5.4967514e-001,1.3198265e-001
8.1381925e-001,-1.5111937e+000,8.3978789e-001,-7.1724498e-001,1.7145443e+000,-8.2046974e-001
-2.6378483e-001,1.0994249e+000,-1.2855987e+000,7.5963891e-001,-8.5954045e-001,1.1162381e+000
1.3037588e+000,9.0992885e-001,1.6916815e-001,1.5560956e+000,1.7616186e+000,1.4720452e+000
1.6459383e+000,1.4027508e-002,8.8093980e-001,-1.6183053e+000,1.3960744e+000,4.7053591e-001
1.0588236e+000,-6.7357023e-001,-9.2313897e-001,-9.8374438e-001,-6.8595834e-001,-5.2862014e-001
4.8771138e-001,9.7572970e-001,-1.4138411e+000,1.4189932e+000,3.1758775e-001,2.3193607e+000
5.1022038e-001,-1.1129203e+000,5.5941008e-001,-9.0233831e-001,-2.9423664e-001,-1.0328573e+000
4.8117881e-001,-1.2958005e-001,-8.6363369e-001,1.1646399e+000,-1.2990366e+000,8.4324051e-001
-1.6465088e+000,-1.1622795e+000,1.4680719e+000,-7.1668183e-001,-4.4843670e-001,-1.2683244e+000
-3.4804304e-001,-5.8724347e-001,2.7986605e-001,-1.3003102e+000,1.4479550e+000,-8.5761392e-001
-1.1513349e+000,-8.7784865e-001,-5.1659691e-001,9.8754576e-001,8.9640107e-001,-4.2334255e-001
-5.8239546e-001,1.4149913e+000,-4.4103059e-001,6.5186234e-001,1.0103611e+000,9.7586506e-001
6.1244645e-001,1.5943026e+000,1.2917568e+000,4.7335599e-001,-4.7102153e-001,1.1337001e+000
1.6388441e+000,-8.8151269e-001,1.3664209e+000,-1.6022619e+000,9.3646296e-001,3.0159063e-002
6.3676944e-002,1.0335820e+000,-1.2390430e+000,-8.2445779e-001,8.9257589e-001,8.6066183e-001
1.5094596e+000,7.7051693e-001,1.3006735e+000,-3.4619169e-001,1.5721183e+000,1.0659165e+000
-8.1564087e-001,4.4363715e-001,6.4060058e-001,2.2076833e-002,-1.0394921e+000,-9.0235289e-001
8.2990598e-001,-1.4969064e+000,1.3168778e+000,8.7723013e-001,-8.1581608e-001,-3.6181807e-001
-1.5967105e+000,1.1741192e-003,-1.1050889e+000,9.9098135e-001,-8.1525478e-001,-2.9859514e-001
-3.8954393e-001,-4.2099893e-002,-7.8535513e-003,-2.1730676e-001,-1.1783408e+000,-6.5021616e-001
4.0566243e-001,-2.6128607e-002,1.6764508e+000,8.1921913e-002,1.2003287e+000,1.6629982e+000
-2.8355284e-001,-8.7331451e-001,-1.2937494e+000,1.1557234e+000,7.8785716e-001,5.8615357e-001
-8.1492481e-001,1.1968295e+000,1.2050509e+000,-1.0824077e+000,-4.3916479e-001,-6.1837976e-001
5.6340644e-001,-4.6361544e-001,9.5645613e-001,-3.2870790e-001,8.8653326e-001,2.7626383e-001
2.6972075e-001,1.0562637e+000,8.7932242e-001,-1.0148082e+000,1.3099305e+000,4.9157309e-001
7.4870539e-001,-2.3632037e-002,-6.2159966e-001,-7.8412560e-001,-1.0583064e+000,-3.5019231e-001
1.4853112e-001,7.2896614e-001,5.6371929e-001,-2.1858602e-001,1.5034630e+000,6.5835002e-001
1.6853920e+000,8.1681534e-001,-1.2930117e+000,1.4724815e+000,-4.7578709e-001,1.1380343e+000
-1.5633770e+000,5.3823836e-001,1.4247986e+000,1.2303501e-002,2.0085660e-001,-5.2364293e-001
-4.2690493e-001,-7.6307827e-001,6.1031810e-001,-1.2998827e+000,4.5858136e-001,-1.4488236e+000
-1.5300346e-001,-1.5063358e+000,1.7036019e+000,3.9381840e-001,9.2877493e-001,1.4173798e-001
4.2708909e-001,4.5894258e-001,-1.4244401e+000,-1.3810600e+000,1.1082304e+000,7.5150459e-001
-1.0790160e+000,2.9222443e-002,2.8263995e-001,1.7057152e+000,3.3647676e-001,2.2022699e-001
1.0998586e+000,-1.5822338e+000,-1.4111748e+000,-3.4648279e-001,-4.5301000e-001,-1.2382045e+000
1.0469173e+000,4.2846282e-001,7.5481084e-001,1.6371813e+000,-3.4708320e-001,1.4411038e+000
7.5494693e-001,-1.0200715e+000,1.3754764e+000,-1.3145131e+000,1.1797764e+000,1.5833198e-001
-7.9707110e-001,-4.8359911e-001,5.2681324e-001,-1.6287178e+000,4.7987809e-001,-1.5464900e+000
1.2343978e+000,-1.1403356e+000,1.1077880e+000,2.0638325e-001,6.2074840e-001,3.8228007e-001
1.6888513e+000,-1.1998002e+000,-6.2014410e-001,-2.5286641e-001,1.0585926e+000,-3.8397946e-001
6.0677384e-001,7.1305198e-001,-1.4372760e+000,-4.5558831e-001,2.4861001e-001,6.0541878e-001
-5.1330796e-001,-7.2291274e-001,2.3264431e-001,1.1322905e+000,-4.8118594e-001,-1.8007175e-001
7.2263144e-001,-3.5742981e-001,1.3606384e+000,7.7577852e-002,1.9625338e-001,9.4413875e-001
1.1649928e+000,-1.1241869e-002,1.1935470e+000,-6.4278388e-001,7.6776046e-001,9.0879874e-001
-1.3188559e+000,-4.0039889e-001,-4.0860237e-001,1.3183839e+000,3.4577628e-001,1.2168073e-001
-1.1949005e+000,-7.5362556e-001,-1.5380736e+000,1.5212901e+000,-4.4028614e-001,4.1604955e-001
1.5995848e+000,1.5181486e+000,5.3683031e-001,1.4830561e+000,8.8788696e-001,2.2056600e-001
2.0298758e-001,-8.1772169e-001,-5.3103094e-001,-2.0303966e-001,-1.1316251e+000,-8.4991484e-001
1.9426094e-001,6.6485617e-001,1.9732233e-001,1.2104453e+000,1.1427419e+000,1.2186745e+000
-1.3890888e+000,-1.3043774e+000,3.9486607e-001,4.3657286e-001,-4.5684489e-001,-1.5061862e+000
-1.0635195e+000,-1.9554526e-001,-1.6972092e+000,1.6317932e+000,-1.0010931e+000,9.6503497e-001
1.1591017e+000,1.6486445e+000,3.4349809e-001,-1.5298302e+000,-1.5567459e+000,-1.5551949e+000
-1.3788300e+000,-1.4707953e+000,4.9395628e-001,-9.2127673e-001,-2.6087661e-001,-2.0950143e+000
3.7346792e-002,-1.4183027e+000,-7.0296110e-001,-5.1944090e-001,-1.0432752e+000,-1.5102367e+000
1.7358441e+000,1.3740685e+000,1.2771701e+000,5.6427535e-001,-1.5364502e+000,-1.6756962e-001
2.8886443e-001,6.5969043e-001,2.5907590e-002,-5.4252824e-001,-7.0752505e-001,-5.6133443e-003
-1.5790359e+000,4.0763590e-001,1.6485510e+000,6.9224294e-001,1.5214404e+000,4.1783780e-001
1.8163507e-001,3.4508363e-001,-9.7936450e-001,3.0288322e-003,6.8236576e-001,9.2507893e-001
-4.7364836e-001,1.2055021e+000,8.7349616e-003,-2.5081586e-004,-5.8499861e-001,-4.3322074e-002
-1.1055886e+000,-4.7969418e-001,-4.0687101e-001,-2.7320992e-002,-4.3185121e-001,-1.3533000e+000
1.1407069e+000,-4.7283722e-001,5.2237253e-001,1.6286037e+000,-8.8813753e-001,1.0125704e+000
-2.5858845e-001,-1.4386091e+000,-7.2363859e-001,-1.2932646e+000,1.7301898e+000,-1.3821918e+000
-8.9985360e-001,8.1609883e-001,-4.1710542e-001,2.3286075e-001,4.7012365e-001,-2.1368141e-001
-1.3025463e+000,1.0413521e+000,-1.1549329e+000,1.0552280e+000,1.4661161e+000,7.3020392e-001
1.0425996e+000,1.7027562e+000,-1.6914910e+000,-1.2000086e+000,-3.0061943e-001,2.7914686e-002
1.2059152e-001,8.4915066e-001,-7.6697369e-003,-5.9075004e-001,3.8486610e-001,-4.3444061e-002
1.3905791e+000,-6.4485822e-002,-4.6723780e-001,-1.5225041e+000,-8.3746033e-001,-2.9607591e-001
7.8534866e-001,1.2224113e+000,1.1429872e+000,-1.4934383e+000,6.7926547e-001,-1.3092518e-002
8.6727008e-001,-1.5902173e-001,-1.5704845e+000,-4.7777288e-001,-1.7266964e-001,1.0440613e+000
-7.0111935e-001,8.1957361e-002,-4.3256824e-001,-1.5498666e+000,-4.7653764e-001,-1.2036512e+000
1.9652171e-001,-2.2685610e-001,-1.6132418e-001,-6.5935790e-002,5.6033449e-001,-1.2415788e-001
-1.6636160e+000,9.7719098e-001,1.6947169e+000,9.2909096e-001,1.0400980e+000,1.1515366e-001
-6.1692014e-001,1.6549546e-001,1.7130101e+000,1.2364421e+000,3.3621073e-001,1.4947541e+000
1.5153267e+000,-6.2670393e-001,-3.3951442e-001,8.0254456e-001,-1.6616314e+000,3.6917993e-001
1.5990210e+000,-7.5656666e-001,9.0370945e-002,2.9705580e-001,3.7332167e-001,2.7382579e-001
-7.1061383e-001,1.0469413e+000,-5.0580359e-001,-3.0713052e-001,2.0707561e-001,-2.8017955e-001
5.0291889e-001,1.4358513e+000,9.4615422e-001,6.1601460e-001,-1.4021282e+000,7.4055151e-001
6.1952821e-002,1.7706564e-001,-7.9969125e-001,1.1163920e+000,5.2831928e-003,1.0281299e+000
-1.6481954e+000,7.6188843e-001,4.9993315e-001,-1.7228763e+000,-1.1840182e+000,-2.5159713e+000
3.2808837e-001,1.3666138e+000,-1.0856336e+000,1.3130606e+000,-6.2436601e-002,1.5995673e+000
-1.2390933e+000,-1.2273491e+000,1.3108406e+000,-1.4618757e+000,-1.4212066e+000,-1.9726682e+000
5.9777971e-001,-1.6535203e+000,1.6713501e+000,9.5682080e-001,-1.0042372e+000,-4.4833045e-001
4.5002174e-001,1.5307069e+000,1.4330941e+000,6.3392737e-001,-1.4456912e+000,1.0921345e+000
4.0742687e-002,-1.1168007e+000,-1.3273926e+000,1.0093463e+000,-1.2259455e+000,2.6526694e-002
1.2196364e+000,1.2239886e+000,1.0682449e+000,4.0006518e-001,2.5547376e-001,1.0270541e+000
-1.2314184e+000,6.5194342e-001,-1.4669131e+000,1.1296506e+000,1.4599171e-001,4.8518273e-001
-3.4260779e-001,-1.1448390e+000,-6.5680256e-002,-2.5198333e-001,-3.5963935e-001,-9.0447211e-001
3.0819864e-001,7.1934751e-001,3.9495333e-002,7.2125810e-001,-7.0969727e-001,8.0565270e-001
-8.5830240e-001,1.2371018e+000,-1.4501016e+000,-6.9511563e-001,-1.2400969e+000,-5.1178856e-002
1.1193924e+000,1.3084039e+000,-1.1994469e+000,1.7497639e-001,2.5584901e-001,1.0716264e+000
1.3643845e+000,8.2934664e-001,-6.9259987e-001,-1.4308176e+000,1.4753829e-001,5.0148491e-002
-1.3243457e+000,-1.2949592e+000,-9.1210507e-001,1.6286548e+000,3.3986527e-001,3.2969460e-001
-2.4216692e-001,-3.6812526e-002,-1.1015908e+000,1.6600404e+000,-2.6273939e-001,9.9447715e-001
5.4587873e-001,3.7930906e-001,-1.0558013e+000,-7.9636475e-001,-1.5472502e+000,4.2809206e-003
2.4397281e-001,2.0528218e-001,8.1866303e-001,6.8949290e-001,1.3137540e+000,1.2857975e+000
-1.1521350e+000,1.5978300e+000,-1.5452444e+000,-3.0757964e-003,1.2324248e+000,1.0219457e+000
-7.0292024e-001,-3.8205302e-001,-1.4669784e+000,8.3726637e-001,-5.2939820e-001,1.7392600e-001
2.2623472e-001,1.6963556e+000,2.6839726e-001,7.5676432e-001,-1.3099754e+000,3.4760587e-001
-7.9939308e-001,-4.3575294e-001,-5.6619667e-001,1.3758022e+000,1.0890171e+000,3.7780631e-001
-1.0126096e+000,1.7306857e+000,3.9077753e-001,1.1937271e+000,1.4502979e+000,1.2027796e+000
4.8738432e-001,-1.3986329e+000,6.2783536e-001,1.7182039e+000,-1.1075113e+000,-3.7728864e-001
-1.7216529e+000,-1.2193378e-001,-1.1758549e-001,-2.6656670e-001,2.8445888e-001,-1.0790370e+000
-6.1340672e-002,-1.6478055e+000,1.1889902e+000,1.2029374e+000,-8.3676741e-001,-3.3703592e-001
-1.7055546e-001,-6.8768849e-001,5.2598853e-001,-1.7107835e+000,1.7341912e+000,-6.1484649e-001
1.0255398e+000,1.7338135e+000,3.3243878e-001,6.3698632e-002,-1.5376372e+000,-3.5482061e-001
7.5916578e-001,-8.6087603e-001,4.2477682e-001,-1.3188775e-001,1.5396414e+000,4.6114656e-001
-1.5967126e+000,1.4957720e+000,4.3826521e-002,3.4647246e-001,-3.8695022e-002,-8.5260193e-001
-1.6428253e+000,9.1807586e-001,-2.7848506e-002,-1.5300369e-001,1.9667317e-001,-1.3265641e+000
1.4236410e+000,-7.4926315e-001,1.2673131e+000,-4.5186507e-001,-1.1670740e+000,-1.7118909e-001
1.5928123e+000,1.0239286e-001,-8.5663324e-001,7.7728412e-001,5.1580454e-001,1.5551835e+000
-3.6226092e-001,-1.4247000e+000,-2.7706521e-001,1.4076162e+000,-1.6720153e-001,-5.0039193e-001
9.6419224e-001,1.4819937e+000,-7.8869707e-002,4.7600328e-001,1.5687783e+000,8.2901182e-001
1.2627000e+000,-4.0118880e-001,1.6984541e+000,1.2882129e+000,-3.8845477e-001,1.6580484e+000
5.0082704e-001,-2.3724957e-001,9.5721353e-001,-1.0448168e+000,-8.1266023e-001,-5.2511688e-001
1.2029160e+000,-1.0162919e-001,-6.5132546e-001,-1.4521549e+000,3.2169371e-001,5.5723340e-002
-1.0152053e+000,9.3182522e-001,2.9406179e-001,1.6736194e+000,1.7077803e+000,1.1139455e+000
9.6331058e-001,8.0560936e-001,1.2817277e+000,1.5075386e+000,1.7416365e+000,2.3427144e+000
7.6119067e-001,-3.3483092e-002,-1.1283126e+000,-3.1683610e-001,-1.0777460e+000,4.3458483e-001
2.1226300e-001,5.0422754e-001,-4.1833365e-001,-4.3034684e-001,-1.7700383e-003,2.2871395e-001
1.0355792e+000,-3.7095062e-001,-2.2992645e-001,1.0759254e-001,-1.2545865e-001,3.2588240e-001
1.2193995e+000,1.6164187e+000,-4.6989010e-001,2.3087272e-001,-9.3159084e-001,-4.2869418e-001
-1.6109961e+000,-3.8666559e-001,-7.8714990e-001,1.0261371e+000,-3.7675958e-001,-5.1767016e-001
-8.9900058e-001,-1.1086069e+000,-6.1279857e-001,-2.7784469e-001,-4.2918700e-001,-1.4447700e+000
-7.2763913e-001,-1.3390022e-001,-8.5874953e-001,6.8735962e-001,-1.9577017e-001,-5.6870734e-002
6.3807379e-001,3.8377303e-001,1.4760842e+000,-5.2248275e-002,-4.5852968e-001,1.2302237e+000
-1.2774429e+000,-1.4788674e+000,-3.1655391e-001,1.6639604e+000,7.7688556e-001,-1.1546290e-001
8.0027078e-001,1.5938961e+000,4.9485038e-001,-1.5371583e-001,-1.1141268e+000,-2.1074067e-001
-7.0055506e-001,5.2573647e-001,5.0225665e-001,9.7405714e-001,-6.1993036e-001,3.8140221e-002
3.5218738e-001,-1.1793584e+000,-1.2501174e+000,-1.8110091e-001,3.8871583e-002,-5.8678467e-001
-7.4645319e-001,-1.6219285e-001,-8.9106392e-001,1.7051985e+000,-1.3881536e+000,3.8616609e-001
-2.8691000e-001,-1.0422811e+000,5.3408553e-001,-1.3782624e-001,4.3777312e-002,-7.2902746e-001
-1.2136351e+000,6.4018446e-001,8.2054884e-001,1.2840432e+000,3.3867474e-002,5.9716196e-001
-4.1314557e-001,1.0827194e+000,2.9746992e-001,-4.4576510e-001,-4.3657778e-001,-1.5772348e-001
-1.7114895e+000,-1.0196691e-001,1.6700331e+000,1.0804010e+000,-1.4050258e+000,-3.0972107e-001
-1.1688841e+000,1.6269107e+000,6.5610549e-001,-1.3240307e+000,-5.6922656e-001,-1.5632389e+000
1.3587270e+000,-1.2424808e+000,8.3902246e-001,-3.9366041e-001,-4.5109688e-001,-1.1279623e+000
1.4852028e+000,1.1490510e+000,1.4233261e+000,8.2084151e-001,-1.7814293e-001,1.1194949e+000
7.5056216e-001,1.6302359e+000,-1.4123819e+000,7.4882376e-001,1.0880194e-001,1.2998375e+000
8.0526414e-001,1.0000540e+000,-7.0302525e-002,1.3631747e+000,-1.0006097e+000,1.2345670e+000
2.3981984e-001,1.0748257e+000,-8.0683200e-001,1.5702561e+000,1.3962994e+000,1.9722618e+000
-4.7610636e-001,2.7198585e-001,-8.6992867e-001,-1.2787095e+000,-3.1796787e-001,-7.9741768e-001
4.1080017e-001,1.0666688e-001,1.3809904e+000,5.4068647e-002,-5.6255338e-001,6.1683256e-001
-7.1201398e-001,-3.2571472e-001,-2.0407591e-001,3.9656872e-001,1.2743901e+000,-4.0731549e-001
-1.2072425e+000,1.3526819e+000,-1.5520341e+000,-1.1665519e+000,1.1133412e+000,-4.3695976e-001
-6.3304957e-001,-8.2042325e-001,4.0203811e-001,-1.4198189e+000,-1.5349355e+000,-2.0779738e+000
-1.5281159e+000,5.7808296e-001,-9.5086108e-001,1.1252524e+000,7.6891198e-001,3.8414293e-002
-8.6222526e-001,-1.0919933e+000,1.6123916e+000,-5.3097694e-001,-1.3241819e+000,-9.4991461e-001
1.1981371e+000,-8.0420180e-001,-2.0150604e-001,-1.4993406e-001,-1.4795947e+000,-5.7766565e-001
1.6651931e+000,4.6938305e-001,-5.3031719e-001,1.1601687e-001,-1.3862247e+000,5.9571878e-001
5.5292114e-001,1.6738809e+000,1.7978974e-001,-6.0616706e-001,-1.4068213e-001,-1.0253211e-001
-3.1680497e-001,1.1748693e-001,-9.3676287e-001,1.2677502e+000,1.2166943e+000,1.0193977e+000
1.8326912e-001,4.9109346e-001,-3.8109034e-001,-7.2088630e-002,1.4259265e+000,4.6035147e-001
-1.2698514e+000,9.0208479e-002,2.3694911e-001,5.0712618e-001,-2.3317849e-001,-7.7384420e-001
8.2869384e-001,-1.3397976e+000,-9.6815522e-001,-1.2829615e+000,-1.1605166e+000,-1.8782453e+000
2.4669102e-001,-2.0918586e-001,-1.3086508e-002,-1.7005475e+000,-3.7495420e-001,-9.4064635e-001
-1.0075765e+000,1.3271257e-001,1.4809201e+000,2.0959869e-001,-1.3271542e+000,-5.3256373e-002
-1.1977871e+000,9.5437790e-001,-1.2669684e-001,-5.8309523e-001,7.6499863e-001,-6.6678337e-001
8.5912430e-001,-9.3790584e-002,-6.1204865e-001,-2.7556544e-002,-1.3690236e+000,6.0412333e-002
-6.2224231e-001,-6.7398261e-001,-1.5850053e+000,1.6062294e+000,1.4224078e+000,1.2606855e+000
1.1186618e+000,9.3372654e-001,7.9609569e-001,5.4966592e-001,1.5886068e+000,1.5024852e+000
1.2792283e+000,-1.4103138e+000,1.5617289e+000,-1.0747398e+000,-1.6214615e+000,-1.0184910e+000
-3.6902159e-001,-3.0349029e-001,6.4207675e-001,-1.2045077e+000,1.6238937e+000,-7.0054523e-001
1.4602031e+000,-7.3013156e-002,1.1328184e-001,4.2565921e-001,1.1047449e+000,1.4286610e+000
1.6972596e+000,-1.4703725e+000,6.0603265e-001,1.2676635e+000,-1.4708885e+000,-6.1187797e-001
6.2222800e-001,1.0439790e+000,2.8655556e-001,1.5912729e+000,3.4004200e-001,1.6442249e+000
-1.5313026e+000,-1.2967793e+000,2.1426306e-001,-3.6498256e-002,7.3191502e-001,-1.1522340e+000
-1.5248508e+000,1.5589784e+000,-1.4420337e+000,-1.0163966e+000,-3.1322383e-001,-7.9783033e-001
9.8876790e-001,3.1909041e-001,8.1330378e-001,3.6217524e-001,1.2080954e+000,1.2884580e+000
3.0022610e-001,-1.1153479e+000,9.1788559e-002,5.6315510e-001,1.7265644e+000,-3.2855218e-001
-3.6476822e-001,-9.4711021e-001,-1.6499223e+000,8.8383652e-002,-1.0321533e+000,-1.6765625e-001
-9.8685376e-001,-8.0497223e-001,5.4679381e-001,-3.6903149e-001,1.4031939e+000,-4.5767990e-001
-1.3650662e+000,1.4477447e+000,1.6786562e+000,1.2566087e+000,9.5434204e-001,1.0527771e+000
1.6997341e+000,-4.9980073e-001,1.7133768e+000,1.6634127e+000,-4.8549735e-001,1.9665798e+000
1.1405083e+000,-1.3638911e+000,-9.9984826e-001,1.6940787e+000,9.5679288e-001,8.3283633e-001
1.2334639e+000,-1.5598444e+000,-4.0572607e-001,-1.0025796e+000,-6.7261677e-001,-1.9238062e+000
-1.7254103e+000,6.6108602e-001,-6.8780541e-001,1.8529604e-002,-1.5052420e+000,-1.1891000e+000
1.6245794e+000,-1.1394890e+000,3.3767680e-001,1.3957534e+000,-5.5651423e-001,1.9181588e-001
1.1938780e+000,6.6038867e-001,1.1161966e+000,2.3255072e-001,-1.3927655e+000,6.2353030e-001
-1.3938910e+000,-9.0386578e-001,6.7410846e-002,8.9828378e-001,7.9324608e-001,-4.3671184e-001
-8.5931117e-001,1.2514647e+000,-1.2995915e+000,8.1993584e-002,-6.7568064e-001,5.7140456e-003
1.4694096e+000,-1.3845450e+000,-3.9014702e-001,1.3809010e+000,9.3887932e-002,-7.5291717e-003
-5.3782567e-001,1.3578515e+000,1.6127642e+000,9.0962790e-001,1.2178025e+000,2.0147530e+000
-1.5397549e+000,1.1026178e+000,-1.5811800e+000,1.2748537e+000,8.6950408e-001,8.0983742e-001
7.8014927e-001,1.0624495e+000,1.3166123e+000,-7.5316316e-001,1.0528198e+000,1.0654152e+000
-7.3364712e-001,2.3039553e-001,-1.0614062e+000,-3.9869029e-001,-8.6923073e-001,-4.9676515e-001
1.7924862e-001,1.3608375e+000,-1.4368942e+000,-1.0229751e-001,9.4452946e-001,1.6497474e+000
-3.9057220e-001,-9.0911262e-001,9.7702821e-001,-1.9180488e-001,7.4737013e-001,-3.1215447e-001
-1.4844669e+000,-5.5890330e-002,1.9558144e-001,5.8858236e-001,-1.5977306e+000,-8.4494727e-001
7.9324151e-001,4.8642269e-001,-1.4033911e+000,-4.3640273e-001,5.4587374e-001,1.4057466e+000
1.2761531e+000,-1.3857111e+000,-1.0963298e+000,9.3865481e-001,4.7505831e-001,-8.1105975e-003
-1.2527278e+000,-1.1541286e+000,1.4825071e+000,-1.6624357e+000,7.1093230e-001,-1.2174458e+000
1.3104453e-001,-1.5632972e+000,9.5813613e-001,-1.6054859e+000,7.8089736e-001,-1.4998533e+000
3.0746092e-002,1.6203784e+000,-1.7305950e-001,-1.1686090e+000,7.1064578e-001,5.4498492e-001
-5.0551714e-001,1.5940293e+000,5.5267010e-001,-2.2739969e-001,-1.5268749e-001,5.8050632e-001
-8.6225843e-001,9.2316011e-001,-3.9750852e-001,-1.6423740e+000,-1.3483284e+000,-1.3366812e+000
-2.9226719e-001,8.5600924e-001,-1.7022372e+000,8.3069268e-001,-1.4865450e+000,1.5174439e+000
6.2202036e-001,8.0446712e-001,-9.5594513e-001,7.9900480e-001,-1.6594295e+000,1.0552501e+000
-3.3321805e-001,-9.4683665e-001,-1.2058732e+000,5.9619532e-001,1.4806528e+000,5.2148008e-001
-1.0796650e+000,-4.1153518e-001,1.6986536e+000,7.2324320e-001,9.6240512e-001,6.0662867e-001
-1.1792845e+000,-1.3125830e+000,-1.1608916e+000,8.1070057e-001,4.9545838e-001,-1.1725845e-001
1.3137903e+000,1.4430501e+000,1.0092369e+000,-3.4967914e-001,7.1003138e-001,9.1470613e-002
-1.7363386e+000,-1.3778925e+000,1.3768449e+000,1.6934292e+000,-1.1427765e+000,-2.3965420e-001
-1.2934784e+000,1.1224959e+000,-1.7805026e-001,-6.9173942e-001,1.0083608e+000,-6.0487988e-001
-1.6757768e+000,4.3552603e-001,1.5658851e+000,1.6724052e+000,-3.1700384e-002,4.4792244e-001
-1.4343984e+000,1.9661115e-002,1.6525363e+000,1.5565093e+000,1.0130139e+000,1.2717258e+000
-7.0877774e-001,1.7437028e+000,1.2919685e+000,1.2287017e+000,1.1825842e+000,1.9558954e+000
1.3281963e+000,8.8069251e-001,-1.1065184e+000,-1.4751263e+000,9.8624532e-002,-6.5653840e-002
3.4980422e-001,-4.5590478e-001,6.1010860e-001,7.8285596e-001,-3.7924828e-001,4.8947882e-001
7.3708752e-001,1.6357710e+000,8.3022662e-002,-3.0993366e-001,-1.0945152e+000,-1.4386595e-001
-5.4069714e-001,1.5256021e+000,-1.2877106e+000,-8.1074077e-001,-1.4377727e+000,-3.0725181e-001
-9.3754865e-001,4.8271143e-001,-1.2696471e+000,-1.0780704e+000,7.9209692e-001,-3.0861453e-001
1.0481322e+000,-1.2272440e+000,1.8303431e-001,-1.1505961e-002,-4.3649623e-001,-8.6121895e-001
-8.9705202e-001,-1.3060979e+000,1.3734453e+000,-1.1049726e+000,1.4623973e+000,-4.4982319e-001
7.2464270e-001,2.6954050e-001,-8.8028934e-001,-2.3527175e-001,3.7338112e-001,9.8649764e-001
-1.3265372e+000,-1.1665618e+000,1.4880888e+000,1.6489146e+000,1.1989381e+000,9.5411792e-001
-6.5671396e-001,-1.4938865e+000,6.0096903e-002,-1.1756107e-001,9.9743615e-001,-1.2316705e+000
-3.2864737e-001,3.1095646e-002,-7.9338447e-001,1.5051910e+000,1.1623042e+000,9.0182335e-001
-1.4098123e+000,-4.3018018e-001,-1.4528329e+000,6.2615286e-001,6.9358576e-001,-1.1699761e-001
1.4484802e+000,4.0497036e-001,1.3700949e+000,-1.4039997e+000,5.9626410e-001,6.2621723e-001
-1.6437506e+000,9.1016177e-002,-4.2821811e-001,3.3342677e-001,5.0004066e-001,-9.0593341e-001
-9.9103584e-001,-1.0750887e+000,-1.6445347e+000,1.7097731e+000,4.6788834e-001,9.3914078e-001
1.2193073e+000,1.3611748e+000,1.5281011e+000,-4.1911732e-001,8.5831610e-001,6.9468744e-001
1.4039694e+000,-3.8946338e-002,-1.0785712e+000,9.4054745e-001,1.5561653e+000,1.9717803e+000
9.1820036e-002,5.9616900e-001,1.5757777e-001,1.6793889e+000,-3.2777681e-001,1.3152713e+000
4.3422043e-001,9.1578527e-001,4.7727916e-002,-7.9997489e-001,1.1121827e+000,6.6582907e-001
1.1200630e-001,-3.1073531e-001,-6.2539585e-001,7.5349328e-001,9.9351765e-001,4.9877298e-001
1.5750712e+000,-1.5370601e+000,7.0551500e-001,5.6377420e-001,7.8758250e-001,-5.2388023e-001
1.2062970e+000,-4.5134421e-001,1.0029289e+000,1.5012742e+000,9.9012975e-001,1.8659542e+000
-1.3117045e-001,-8.5021694e-001,-3.3563667e-001,-1.5937397e+000,1.3647542e+000,-9.7116472e-001
6.4084549e-002,1.7156205e+000,1.5930095e+000,-8.0638385e-001,-1.3448777e+000,5.8940683e-001
7.3045313e-001,1.7084327e+000,-1.4957509e+000,8.0196771e-001,1.4620190e+000,1.9362520e+000
1.2732904e+000,-1.2619694e+000,7.1721380e-001,1.6595126e-001,-8.9986028e-001,-8.3096667e-001
1.5369600e+000,1.7212155e+000,-1.3514859e+000,-4.2723315e-001,-3.1014996e-001,-9.1597273e-001
-1.3152201e+000,2.7269569e-001,1.0638083e+000,-1.1839061e+000,-3.9477439e-001,-1.4175788e+000
-1.5206965e+000,8.7385791e-001,1.2301357e+000,3.4660605e-001,-7.9903174e-001,-5.6175596e-001
-1.1716151e-002,4.4071225e-001,-1.0118234e+000,-2.1820804e-001,-9.8951462e-001,3.0956310e-001
3.4387373e-001,-2.4518018e-001,7.4637387e-001,4.9772395e-001,4.9963908e-001,6.4691298e-001
-1.9143017e-001,1.3175030e-001,-9.4843751e-001,4.0129336e-001,1.2526442e+000,1.0069308e+000
1.6466938e+000,8.6539976e-001,5.3794917e-001,-2.7223242e-001,7.1647847e-001,3.0860985e-001
5.4471637e-003,-1.1522540e+000,4.5709492e-001,1.0815714e+000,3.4427352e-001,4.0670641e-002
1.7089995e+000,-6.5117625e-001,-1.1454572e+000,9.7372016e-001,-1.3395660e+000,9.0698073e-001
3.9534134e-001,1.2588155e+000,5.3693641e-001,-4.1746287e-001,-1.1372630e-001,2.9256267e-001
-5.5551770e-001,1.7298813e+000,4.4816490e-001,-4.0001498e-002,3.2089811e-001,5.5569871e-001
2.9070239e-001,1.3876078e+000,-1.2158675e-001,-9.5717320e-001,-9.8643921e-001,-1.0946710e-001
1.1514292e+000,-1.1569927e+000,-1.6763367e+000,1.1523274e+000,1.7259147e+000,1.6233093e+000
-1.0173748e+000,1.5867591e+000,5.8836398e-002,-1.3192068e+000,-6.4560516e-002,-1.1194672e+000
-1.4611408e+000,-1.8421005e-001,-2.4935795e-001,-1.2015796e+000,1.7072452e+000,-1.2130438e+000
-2.3671616e-002,-5.6319942e-001,-8.5755700e-001,-9.7063994e-002,-5.1304278e-001,-3.3295573e-001
1.3204062e+000,3.3627611e-001,1.5700256e+000,4.9200338e-001,9.0228701e-001,2.0397035e+000
6.8677152e-001,-3.1544194e-001,-1.3463495e+000,2.1081788e-001,-1.5751783e+000,2.1396105e-001
1.3593322e+000,-1.1975583e+000,8.7944449e-001,1.2364484e+000,-1.4641089e+000,-2.6491610e-001
1.4638606e+000,-5.6562052e-001,-9.2867600e-001,-2.7160148e-001,-1.6121345e+000,-8.6792024e-003
2.3632946e-001,4.5357698e-002,9.1755293e-001,-1.7104208e+000,-9.9914314e-001,-6.3766940e-001
8.3221683e-001,1.2605229e+000,-6.8725796e-001,7.8307987e-001,-2.2246387e-001,9.8559010e-001
6.8669255e-001,5.6574273e-001,1.0236460e+000,9.7555831e-001,-1.6593096e+000,1.2409065e+000
-3.7865157e-001,1.4341959e+000,6.1551411e-001,-1.0823388e+000,-2.7814251e-001,1.3591062e-001
1.5526099e+000,-1.2246558e-001,-1.6537680e-001,-7.8193309e-001,-3.9382871e-001,-1.1220212e-001
-6.8599182e-001,5.9213047e-001,6.4346186e-001,8.1850781e-001,2.2534239e-001,3.9202606e-001
-1.0622024e+000,-1.1675668e+000,4.4364123e-001,-1.0194857e+000,-5.2261255e-001,-1.6481833e+000
-2.9917962e-001,1.4909063e+000,-1.4712785e+000,-9.8967486e-001,-1.3892024e+000,1.4017732e-001
1.3302667e+000,1.2399549e+000,-1.0050980e+000,1.9458972e-001,1.7453513e+000,1.2234790e+000
1.2993547e+000,1.4161012e+000,1.6821412e+000,-1.5168820e+000,1.3421086e+000,4.4712211e-001
2.9008234e-001,1.3428948e+000,1.0282491e+000,-4.7579387e-001,2.8337591e-001,1.0902486e+000
-1.4014843e+000,1.1369980e+000,1.4682000e+000,-1.0143685e-001,-8.9824507e-001,-9.2676517e-002
-8.1027727e-001,-1.0392580e+000,9.9995923e-001,-1.0290120e-001,-9.4109779e-001,-1.3090831e+000
-1.5275997e+000,5.1941035e-001,3.8906011e-001,-1.3471642e+000,1.1311877e+000,-1.1912538e+000
-1.1602952e+000,-4.2973124e-001,-1.4161552e+000,2.2263319e-001,-1.3490143e+000,-5.4506062e-001
1.0135584e+000,-1.0656432e+000,6.4069111e-001,-6.6586970e-001,-7.2329892e-001,-1.0649294e+000
-1.7294803e+000,6.9910496e-002,-6.9670134e-001,1.1369958e+000,5.4961377e-001,-5.0837008e-001
4.8032569e-001,8.9247912e-001,-5.6618338e-001,-6.8096476e-001,1.1951983e+000,6.7218040e-001
1.2786485e+000,-7.3726887e-001,-1.5818912e-001,1.4624191e+000,-9.1179163e-001,6.0180422e-001
2.1308505e-001,8.4502634e-001,-1.4830593e+000,-8.0604947e-001,1.5645341e+000,1.3288986e+000
-3.3372889e-001,-1.3842523e+000,-7.1496415e-001,-7.0543363e-001,-1.1780659e+000,-1.7732430e+000
9.4399181e-001,-7.5438257e-002,-8.3677798e-001,9.1934435e-001,1.5596549e+000,1.9041044e+000
-1.8792232e-001,-1.2157499e+000,2.3758782e-001,-1.6893162e+000,-5.8233800e-002,-1.9388523e+000
-2.3535984e-001,-8.0525419e-001,1.6753410e+000,3.6594848e-001,-3.2607306e-001,1.8533240e-001
1.4321230e-001,1.7550527e+000,-1.6728706e-001,1.4916571e+000,-1.1435601e+000,1.1660203e+000
-1.3583945e+000,4.0787039e-001,1.0132257e+000,-2.5290210e-001,4.1354150e-001,-1.1117780e+000
6.6082376e-001,-1.1488164e+000,7.3722794e-001,1.1151064e+000,-1.5358829e+000,-6.4193242e-001
1.2889510e+000,-2.8876860e-001,1.0206946e+000,-1.4812970e-001,-1.0265533e+000,2.2317789e-001
-1.6983485e+000,1.5529094e+000,-1.0249631e+000,-3.6992552e-001,-4.9023490e-001,-9.9748560e-001
-3.6227158e-001,-1.0854183e+000,-6.4925792e-001,1.6604557e+000,9.4730502e-001,4.6873127e-001
-1.0331820e+000,2.0307389e-001,1.2621508e+000,1.6787651e+000,1.4013500e+000,8.1951549e-001
6.8916475e-002,-8.6479711e-002,1.2140264e+000,-1.5738437e+000,-1.0733507e+000,-7.9360785e-001
1.1354290e+000,-8.8523601e-001,-3.5383644e-001,1.5207927e-001,-7.1779997e-001,-2.3952973e-001
-2.8123637e-002,-1.2579336e+000,9.6659878e-002,1.4186190e+000,9.5926142e-001,2.2054077e-001
9.5900565e-001,3.3318955e-002,-7.0795395e-001,3.6585291e-001,-5.7498065e-001,3.9343324e-001
6.2436381e-001,-1.1932809e-001,7.9774503e-001,-1.7171346e+000,1.2242419e+000,-5.5795427e-001
-1.2666992e+000,-9.4845846e-002,1.2051347e+000,9.9958076e-001,1.4152516e+000,5.1899263e-001
3.0141821e-001,-9.9106704e-001,5.1562555e-001,1.5481189e+000,1.0394628e+000,8.0573538e-001
-4.0505363e-002,-1.0035206e+000,-2.3127236e-001,-5.0570958e-001,1.5835539e+000,-5.6127720e-001
-4.6413695e-001,-1.0136461e+000,-2.7802675e-001,1.2893306e+000,-1.6758431e+000,-6.0793892e-001
3.1433044e-001,1.0637948e+000,1.0567832e-001,-6.4503413e-001,1.5849290e+000,1.1588785e+000
-1.4898091e+000,1.2285249e+000,-7.9006496e-001,5.9232524e-001,1.0194742e+000,-4.4849398e-001
-4.6293128e-001,3.3273117e-001,1.2335264e+000,-9.9076782e-001,-6.5226934e-001,-5.1779809e-001
6.8267471e-001,1.3265906e+000,-1.1797358e+000,-9.1981840e-001,-1.0386768e+000,2.6147580e-002
1.1069337e+000,-5.4461219e-001,1.6804569e+000,6.6922452e-001,4.5792391e-002,1.5422247e+000
1.5529359e+000,2.0296329e-001,-1.0541224e+000,1.7686228e-001,-3.9928331e-001,1.1356277e+000
-4.1777202e-001,1.2109753e+000,-5.5848854e-001,-1.1395638e-001,8.2222523e-001,2.2440095e-001
1.5812105e+000,-3.4468186e-001,-7.0861872e-001,1.3968389e+000,3.4178012e-001,1.1739112e+000
1.0859553e+000,-1.6136909e+000,5.5812884e-001,1.3856941e+000,1.1838843e+000,-1.0768077e-001
-4.0306193e-001,-1.6519503e+000,-2.8527223e-001,1.3821228e+000,-1.4019288e-001,-6.5431818e-001
8.8223823e-001,5.3984432e-001,1.6451415e+000,1.1012775e+000,6.1551984e-003,2.2221372e+000
4.3926414e-001,-2.7183042e-001,1.5757285e+000,-7.5838423e-001,4.1578193e-001,6.9725679e-001
1.2557637e-001,5.2225798e-003,1.0876941e+000,-1.3950131e+000,3.9229167e-001,1.7400102e-002
3.0941406e-001,1.5081469e+000,-4.2430367e-001,-1.0778302e+000,1.1192067e+000,2.8143840e-001
-4.2316995e-001,-1.0279351e+000,-1.4525425e+000,8.2612548e-002,-1.2933243e+000,-4.1548110e-001
4.7700819e-001,6.1804554e-001,-1.5653661e+000,7.8393594e-001,1.4567814e+000,2.2498958e+000
5.9124680e-001,-1.3126769e+000,8.0639425e-001,6.7792999e-001,1.7229564e+000,1.4316528e-001
1.7210189e+000,5.3802128e-001,4.6495608e-002,-1.2806268e+000,-4.5077098e-001,-6.7768614e-001
1.1191916e+000,3.6840394e-002,9.3651862e-001,-1.8754108e-001,1.0636074e+000,7.2669708e-001
1.4629863e+000,-1.6161539e+000,1.4938449e+000,9.3797363e-001,-1.2641729e+000,-3.0760300e-001
-7.5658494e-001,4.5346515e-001,-1.5185559e+000,9.2966901e-002,-1.4383866e+000,-6.3536774e-002
-1.0716250e-001,1.5214112e+000,-1.6825535e+000,1.4091458e+000,-1.6737518e+000,1.5075345e+000
1.3803164e+000,-6.0048830e-001,-1.0579483e+000,4.7374908e-001,5.4394506e-001,7.8318728e-001
-3.2338471e-001,1.2247067e+000,1.5037513e+000,6.3062344e-001,-1.1296256e+000,1.4423173e+000
-2.5360571e-001,-9.4196592e-001,4.7916512e-001,-4.9077899e-001,7.4039385e-001,-4.9263587e-001
-1.2497653e+000,1.8972186e-002,-1.6037227e+000,1.0756052e+000,1.3252270e+000,8.0908085e-001
6.0629366e-001,-1.3872684e+000,1.0036357e+000,1.3694546e+000,-1.3883970e+000,-4.3692821e-001
3.0681304e-001,7.1791779e-002,-8.1055555e-004,-2.7120420e-001,-1.0055262e+000,-8.3620665e-002
1.2227057e+000,-5.4663419e-001,-9.5121201e-001,1.5359773e+000,-1.4456136e+000,6.9976171e-001
-3.1549322e-001,-1.1620764e+000,1.1817603e+000,2.8524223e-002,-1.0730283e+000,-8.3171714e-001
-1.6444576e+000,-4.0021506e-001,-1.8661268e-001,-1.1044075e+000,-6.9424882e-001,-2.4028255e+000
4.8911770e-001,1.0999816e+000,1.2367243e+000,-1.5572546e+000,-7.1842641e-002,2.2394717e-001
6.7266948e-001,-8.5428625e-001,5.7337530e-001,-1.6904735e+000,1.3675399e-001,-9.2406974e-001
5.9101709e-001,-1.4783567e+000,3.2374215e-001,6.0224312e-001,-9.1258665e-001,-1.0116120e+000
-1.5941896e-001,-8.7089596e-001,5.4448137e-001,-1.0062551e+000,5.3754545e-001,-1.1219541e+000
1.2929405e+000,5.0221800e-001,-9.0735627e-001,9.8710599e-001,1.0614835e+000,1.7793988e+000
-1.3749264e+000,-1.4302081e+000,1.6484723e+000,-6.0341826e-001,-4.2292799e-001,-7.5851877e-001
-1.1649173e+000,1.2617404e+000,3.0893148e-003,-1.3649849e+000,-6.0625446e-001,-1.6458014e+000
-8.9609702e-001,1.1331767e+000,1.5230356e+000,9.1792360e-001,-1.7439047e-001,8.0119230e-001
2.1620780e-001,6.2362778e-001,-2.0683998e-001,-7.7359433e-001,-1.2848399e-001,3.8386768e-002
4.4082613e-001,1.0756629e+000,7.8711475e-001,1.4294862e-001,-7.9426182e-001,8.6957352e-001
-1.7112855e+000,-1.6649687e+000,6.8265269e-001,-1.2299907e+000,-1.6833872e+000,-2.4093466e+000
-1.2091306e-001,2.0745319e-001,-2.3874997e-001,-3.5831298e-001,1.4085287e+000,2.4132467e-001
-8.8379095e-001,1.6374953e+000,-6.0894903e-001,-9.5277443e-001,9.0774657e-001,-2.7465393e-002
1.4789206e+000,-6.7845787e-001,-9.0446160e-001,1.4242629e+000,-3.4243646e-002,1.1727264e+000
-9.2038326e-001,5.7821784e-001,5.4816683e-001,-1.0025532e+000,-2.5234119e-001,-1.4478688e+000
1.3746592e+000,-8.5233293e-001,4.7270352e-001,1.4134826e+000,8.5177126e-002,6.1724086e-001
-5.9850717e-001,9.7708136e-001,-1.0132723e+000,-1.4265961e+000,6.0553262e-001,-2.0424388e-001
8.8566199e-001,7.7588324e-003,1.7793476e-001,1.4172214e+000,-4.5469424e-001,1.1170281e+000
-6.1612236e-001,-1.2515954e+000,-9.3317771e-001,-5.7488716e-001,1.5736369e+000,-7.3019725e-001
9.5432717e-001,4.5328063e-001,-1.2839664e+000,6.3963042e-001,-1.5208810e+000,1.1079938e+000
1.0551935e+000,1.3188904e+000,8.3847911e-001,-1.3790299e+000,1.6186519e+000,-3.2245092e-002
9.8249280e-001,-1.0452811e+000,1.2768020e+000,1.3120056e+000,7.7472159e-001,6.7256684e-001
-1.3429970e+000,6.0644508e-001,4.6980643e-001,-3.6598679e-001,5.6509991e-001,-8.1201141e-001
4.7289652e-001,1.0148288e+000,2.6421230e-001,-1.6783317e+000,3.8830778e-001,-1.8927225e-001
3.2223729e-001,-5.3101547e-001,-1.1277112e+000,-1.0498831e+000,1.7469744e+000,4.8947736e-001
-5.2125427e-001,-8.5684188e-001,-1.3607000e-001,1.1323716e+000,-1.1490389e+000,-4.4046872e-001
-9.5126267e-001,9.0453452e-003,1.4874602e+000,1.1079068e+000,1.5067417e+000,1.3168974e+000
1.7054993e+000,-7.0113298e-001,-1.4760461e+000,1.1534948e+000,-1.5739773e-002,1.3910135e+000
6.6255535e-001,3.3618439e-001,-3.3687349e-001,-1.4532322e+000,4.3398611e-002,-3.4946844e-001
6.5455827e-001,-6.2976911e-001,3.6230379e-001,-1.5186416e+000,-1.0200542e+000,-1.2833522e+000
3.7490000e-001,6.4071003e-001,-7.3710709e-001,-1.5771055e+000,5.6812462e-001,-2.0749118e-001
-1.6344554e+000,-1.6394308e+000,7.4583645e-001,1.0312391e+000,-3.7470703e-001,-6.5740761e-001
-4.3010886e-001,-3.9860011e-001,8.6048045e-001,6.3067777e-001,-4.9038194e-001,8.2810837e-002
7.0630395e-001,9.0942533e-001,-5.7489587e-001,1.5835391e+000,-8.8954759e-001,1.2198108e+000
1.3346439e+000,-1.5294372e+000,7.6129997e-001,2.3752690e-001,2.9287232e-001,-1.1628468e+000
1.4313534e+000,1.5508657e+000,-2.9879742e-001,8.3522590e-001,-1.3482792e+000,-3.5632890e-001
5.9797784e-001,1.0236693e-001,3.8069024e-001,-6.6362353e-001,-1.3771152e+000,-2.1059477e-001
-3.0289345e-001,-1.0542791e+000,1.4502504e-001,1.6541080e+000,-1.0889969e+000,3.4808968e-002
6.9002207e-001,1.6662024e+000,-9.3843733e-001,-1.7621105e-001,-4.5182938e-001,1.3085894e-001
-2.5300300e-001,9.6158455e-001,1.1342885e+000,-1.7537849e-001,3.1634004e-001,7.1307438e-001
-1.7359198e+000,-2.2889000e-001,-1.0323617e+000,-5.9211418e-001,-6.8372981e-002,-1.3986235e+000
5.7581280e-001,6.2856306e-001,1.4834776e+000,3.3272710e-001,7.0427650e-002,1.4874701e+000
-1.3781557e-001,6.3712176e-001,-4.4037973e-001,-4.9544827e-001,8.8097299e-001,1.1798768e-001
4.8240223e-001,-1.5586068e+000,1.1347871e+000,1.5304226e+000,7.9826607e-001,5.7277099e-002
7.0749009e-001,-1.6075772e+000,-3.4778211e-001,-1.3128757e+000,2.1984296e-001,-1.9548084e+000
-7.1446130e-001,-7.5679823e-001,-1.3976788e+000,1.2228831e+000,1.4624760e+000,9.1923552e-001
-1.4533193e+000,-1.3373047e+000,1.0887667e+000,4.2954332e-001,3.4472273e-001,-3.6907604e-001
-3.2423598e-001,-2.5688638e-001,1.2637771e+000,1.2649810e-001,-5.9257311e-001,1.4144893e-002
1.6949155e+000,-4.4336402e-001,8.4656413e-001,1.0401312e+000,6.9756574e-001,1.5992646e+000
-3.7372476e-001,-1.0441553e+000,1.4330213e-001,-2.2742210e-001,-5.8764970e-001,-1.1802261e+000
-9.3605911e-001,-1.0354902e+000,-1.0850249e+000,-3.5396075e-001,4.6990079e-001,-8.3622785e-001
1.5173675e+000,2.1813582e-001,-2.6149830e-001,-1.6066215e+000,-9.9973632e-001,-4.0626372e-001
1.0344279e+000,-9.3488340e-001,1.3753123e+000,-8.7682181e-002,-1.4077823e+000,-2.0557072e-001
-1.9889312e-001,-7.5753960e-001,-2.4113753e-001,1.1391113e+000,1.7424730e-001,1.4783094e-001
1.1712794e+000,-8.8329029e-001,-8.4406449e-001,1.0693884e+000,6.6364218e-001,7.8426534e-001
1.6606176e+000,-4.9485144e-001,-7.7248087e-001,2.1994086e-001,-8.4590166e-001,4.3063673e-001
1.2531388e+000,1.7041297e+000,8.7589718e-001,-1.5673113e+000,9.9358139e-002,-1.3115475e+000
-2.8224808e-001,1.1056756e+000,1.2543364e+000,-5.3483787e-001,1.6883522e+000,8.3435072e-001
-1.5817159e+000,-1.4385695e+000,1.2373340e-001,-1.3982144e+000,-1.4426450e+000,-2.7584428e+000
1.6914939e+000,1.6199064e+000,8.2139772e-001,1.5440559e-003,-1.2218516e+000,-8.9478675e-001
-1.2186653e+000,1.1722507e+000,5.7805541e-001,1.2095833e+000,-3.3974875e-001,1.2598432e-001
1.4069374e-001,-1.0112574e+000,-1.4294439e+000,1.4292376e+000,1.4762297e+000,1.2007252e+000
-1.7416372e-001,-5.7839668e-001,1.6430653e+000,2.2649099e-001,1.1620156e+000,8.6752533e-001
-1.7039275e+000,-1.6367500e+000,4.4565212e-001,8.1934097e-001,-1.4534378e+000,-1.1638980e+000
-1.4410078e+000,-1.3451269e+000,-1.3905605e+000,1.2148723e+000,1.0585368e+000,3.7676370e-001
3.3184652e-001,-4.2899972e-001,-9.4665396e-001,4.6804411e-001,-1.0484316e-001,3.9185702e-001
-5.8233986e-002,-5.6902694e-001,1.3555557e+000,6.1238668e-001,7.5272677e-001,7.8018043e-001
1.4761157e-001,2.9086788e-001,-1.2826299e+000,-7.9314539e-001,1.4857835e+000,1.0202311e+000
-8.3863410e-001,-1.5762257e+000,5.6917074e-001,-1.2692718e+000,7.7304451e-002,-2.3260023e+000
2.6556686e-001,4.1656649e-001,-8.2438934e-001,-1.6729158e+000,2.7615290e-001,3.0373661e-001
-6.8313965e-001,-1.3859651e+000,-1.1717362e+000,-6.2407904e-001,-1.1152132e+000,-1.1012867e+000
-8.8501439e-001,8.5929676e-002,1.7155042e+000,1.2130080e+000,-9.9124025e-001,8.8432970e-001
2.7146918e-001,-9.6132644e-002,-4.4772640e-001,-1.0521268e+000,8.9083156e-002,-3.4810567e-001
-6.2784083e-001,-1.4399830e+000,-4.4401506e-001,1.4316134e+000,-1.0637191e+000,-3.5722241e-001
-1.3734875e+000,-1.4038938e+000,9.3208226e-001,-1.0507918e-002,-1.1186705e+000,-1.2599777e+000
-1.1026524e+000,1.1415336e+000,-1.3991077e+000,-1.6215355e+000,5.4005875e-001,-8.2348396e-001
4.7233270e-001,1.5675287e+000,-1.4517707e+000,-2.4537894e-001,2.4859873e-001,1.3897052e+000
-4.3646389e-001,-8.3453760e-001,1.6013384e-001,-1.5132440e+000,1.0639867e+000,-1.7710505e+000
1.5271721e+000,1.0489224e+000,-1.2732654e+000,3.9510364e-001,6.6726601e-001,1.2247422e+000
-1.2145330e+000,1.5660962e+000,-1.8976672e-001,1.6419521e+000,1.7482292e+000,1.1010424e+000
8.9764669e-001,1.4300858e+000,-3.4206294e-001,-1.1271586e+000,-8.3769226e-001,-6.8370373e-001
-9.5651097e-001,1.5418827e-001,-1.3929670e+000,-1.5203752e+000,-2.3388027e-001,-6.4504373e-001
2.8768697e-001,1.7125583e+000,1.0771680e+000,1.4564442e+000,1.1866244e+000,2.0003321e+000
-9.4988755e-001,-1.1735656e+000,6.1707253e-001,3.7213743e-002,4.6166152e-002,-9.7568505e-001
-2.9487018e-001,1.1012516e+000,1.2327360e+000,1.5366786e+000,6.0342328e-001,2.1312665e+000
-6.2716729e-001,1.0220187e+000,-7.4016217e-003,9.8106853e-002,-1.3005270e+000,-1.5319193e-001
-2.9097974e-001,-6.3893435e-002,9.6068244e-001,-1.4984547e-001,-1.2864097e+000,-6.1156574e-001
8.8175102e-001,7.1283987e-002,1.2121574e+000,-4.8719404e-001,-2.0338810e-001,8.5252779e-001
-1.2453525e+000,1.7138457e+000,-1.6538791e+000,3.3019113e-001,5.9607921e-001,6.6967162e-001
1.2457285e-001,4.8698972e-001,-9.5846074e-001,-1.0049960e+000,-1.5586547e+000,-2.9700053e-001
6.6388802e-001,5.3757857e-001,-1.2014675e+000,-1.5291117e+000,1.6666527e+000,9.1101392e-001
-1.0371702e+000,8.8026418e-001,-1.0852265e+000,-1.0853933e+000,1.6706396e+000,1.2957775e-001
-6.3374306e-001,-5.2255117e-001,-1.4432348e+000,2.8747591e-001,8.9124306e-002,3.7326102e-001
4.4560009e-001,1.3841150e-002,-7.7408724e-001,-7.6686415e-001,-4.6843900e-001,4.5687128e-002
6.6770492e-001,1.5762467e+000,5.2231585e-001,-9.1410551e-001,-1.4240231e+000,-6.2824455e-001
1.1398337e+000,-9.6647964e-001,-9.9977601e-002,1.0268374e+000,4.5922110e-001,5.0019812e-002
1.7394561e+000,3.8720699e-001,-9.9342542e-001,2.5729281e-001,-1.5665168e+000,6.3254164e-001
2.8264985e-001,1.5991939e+000,-1.3964914e-001,-1.2211890e+000,6.2588693e-001,7.6800769e-002
-9.5339885e-001,-2.9016157e-001,-6.8858199e-001,1.2677805e+000,8.9831709e-001,2.1893528e-001
-1.5535087e+000,1.2503060e+000,-9.0312337e-001,-1.3578921e+000,1.9773766e-001,-1.8859623e+000
1.0102698e-001,8.9290889e-001,1.7151613e+000,-7.2560297e-001,1.6624570e+000,1.7792643e+000
4.0050110e-001,1.5671262e+000,-4.7533887e-001,6.2069257e-001,4.6482955e-002,6.1276111e-001
1.4253437e+000,-1.2433230e+000,-1.0525285e+000,-1.6758774e+000,-1.4433279e+000,-1.6108612e+000
-4.0584785e-001,1.1589254e+000,-1.3950791e+000,1.1160476e+000,-3.0776256e-001,1.6922726e+000
-1.4011039e+000,-1.5857677e+000,-1.3276303e+000,1.2437370e+000,1.5663134e+000,1.0499282e-001
-1.3483293e+000,6.4252996e-001,-1.0859331e-001,7.0201162e-001,8.2756318e-001,7.9868657e-002
5.0951601e-001,-1.0322549e+000,9.1121923e-001,-1.2587899e+000,-4.6914064e-001,-1.4066208e+000
1.7115451e+000,2.2033335e-002,1.3260224e+000,-5.6650735e-002,-1.3475833e-001,1.5226562e+000
-8.2703320e-002,-8.4779614e-001,-9.4651885e-001,3.2900635e-001,1.1323982e+000,5.2565916e-002
-2.5021262e-001,-8.3790698e-001,-8.3604498e-001,3.7710733e-001,1.3291081e+000,-4.0786068e-002
7.7645812e-001,-1.7893587e-001,-3.0903202e-001,1.6901834e+000,-3.4382223e-001,9.2638034e-001
1.7265944e+000,9.2007976e-002,-3.2043312e-001,-4.9395417e-001,1.7651494e+000,3.3221247e-001
-1.9244226e-001,1.2898776e+000,-9.9996671e-001,5.5427500e-001,4.8673303e-001,1.1868728e+000
1.5595708e+000,1.2717761e+000,9.1550576e-001,-2.7895066e-001,2.3645791e-001,2.5356670e-002
3.7436691e-001,-9.5165014e-001,3.8151373e-001,2.3699959e-001,4.5829535e-001,4.8289341e-002
-1.1054426e+000,-1.5023584e+000,-1.4226828e+000,9.0071303e-001,-3.6887306e-001,2.1134435e-001
-1.1794564e+000,-8.2382667e-001,7.7198914e-001,-7.6734653e-001,3.5700184e-001,-1.2989915e+000
-2.7127805e-001,9.5353921e-001,-1.5611097e+000,4.9365577e-002,-9.7774757e-001,7.2000706e-001
-4.9170814e-001,2.2742328e-001,-7.2847711e-001,-1.3929343e+000,-1.1138653e-002,-5.9403761e-001
-2.4385727e-001,-1.1854872e+000,1.9537696e-001,2.5218229e-001,8.8528334e-001,-3.8721009e-001
1.0082251e+000,1.6319852e+000,1.3755279e+000,-3.6676679e-001,-9.7995923e-001,2.7003825e-001
-4.3787746e-002,-2.0974029e-001,9.2074234e-001,-4.8866489e-001,9.2379644e-001,4.8243638e-001
-1.7385189e+000,-1.3065542e+000,-1.5498021e+000,-7.4109774e-001,1.3293833e+000,-5.4311712e-001
-1.5876349e+000,-1.1105366e+000,-6.0848032e-002,2.1108075e-001,4.7954549e-001,-1.2548603e+000
1.3291331e+000,7.9339742e-001,8.6133117e-001,8.0255254e-001,1.6207284e+000,1.4330613e+000
-6.6934235e-001,-1.3306329e+000,-4.4809409e-001,1.4906151e-001,1.1877061e+000,-7.5372822e-001
1.1209482e+000,4.0661335e-001,-2.2684493e-001,5.9522513e-001,-1.1491387e+000,7.8540553e-001
-6.8010217e-001,-1.5459674e-001,-7.5623512e-001,8.5270397e-001,9.1703658e-001,6.9813727e-001
-2.8171506e-001,-3.7855757e-001,-8.5216183e-002,1.5505297e+000,-1.4301416e+000,1.0705916e-001
1.1268833e+000,8.8119603e-001,4.0996864e-001,5.6001536e-001,-1.4291215e+000,3.3068617e-001
-1.5827544e+000,1.2076101e+000,-1.1126974e+000,-4.7068413e-001,-1.3466644e+000,-1.3638939e+000
-1.5085659e-001,-1.4054606e+000,1.6589299e+000,-8.9672656e-001,1.1483043e+000,-6.5391240e-001
6.8028096e-001,-3.3716302e-001,-7.5180304e-001,8.3321161e-001,-7.1950049e-001,5.9445955e-001
1.6463797e+000,-1.4752290e+000,-1.2784929e+000,-1.0859247e+000,6.8292449e-002,-1.1020272e+000
-1.4646701e+000,9.6878839e-001,-1.5380163e+000,8.2079197e-001,-3.5785218e-001,3.1189251e-001
1.0337012e-001,-1.5993228e+000,-1.4852478e+000,-1.2765202e+000,2.8981019e-001,-1.2241594e+000
-4.0223018e-001,1.8910544e-001,9.5769966e-001,8.0663141e-001,2.3251562e-001,5.8545322e-001
1.6195039e+000,8.2799968e-002,-1.3067147e+000,9.9899658e-001,1.3931567e+000,2.0520528e+000
-1.6768248e+000,1.1882701e+000,8.9820499e-001,-1.2232265e+000,3.7163349e-001,-1.9139920e+000
-1.7230374e+000,1.3646601e+000,-9.8021640e-001,1.7145114e+000,-4.1309887e-001,-1.1904298e-001
8.8466629e-002,1.4380468e+000,8.0194583e-001,-1.3482130e+000,-4.3681496e-001,-3.4964869e-001
-1.1904256e+000,1.3062937e+000,-9.6491225e-001,6.9978411e-001,-5.1385143e-001,1.6431848e-001
