{
  "data_set_description": {
    "default_target_attribute": "oz51",
    "description": "**Author**:   \n**Source**: Unknown - Date unknown  \n**Please cite**:   \n\nThe Friedman datasets are 80 artificially generated datasets originating from: J.H. Friedman (1999). Stochastic Gradient Boosting\n\nThe dataset names are coded as \"fri_colinearintydegree_samplenumber_featurenumber\".\n\nFriedman is the one of the most used functions for data generation (Friedman, 1999). Friedman functions include both linear and non-linear relations between input and output, and a normalized noise (e) is added to the output. The Friedman function is as follows: \n\ny=10*sin(pi*x1*x2)+20*(x3-0.5)^2=10*X4+5*X5+e\n\nIn the original Friedman function, there are 5 features for input. To measure the effects of non-related features, additional features are added to the datasets. These added features are independent from the output. However, to measure the algorithm's robustness to the colinearity, the datasets are generated with 5 different colinearity degrees. The colinearity degrees is the number of features depending on other features. \n\nThe generated Friedman dataset's parameters and values are given below: \nThe number of features: 5 10 25 50 100 (only the first 5 features are related to the output. The rest are completely random)\nThe number of samples: 100 250 500 1000\nColinearity degrees: 0 1 2 3 4\nFor the datasets with colinearity degree 4, the numbers of features are generated as 10, 25, 50 and 100.\nThe other datasets have 5, 10, 25 and 50 features.\n\nAs a result, 80 artificial datasets are generated by (4 different feature number * 4 different sample number * 5 different colinearity degree)\n\nThe last attribute in each file is the target.",
    "description_version": "1",
    "file_id": "1390086",
    "format": "ARFF",
    "id": "583",
    "licence": "Public",
    "md5_checksum": "13d9eac1f0d6e7839cd5a7dec9c643f5",
    "minio_url": "https://data.openml.org/datasets/0000/0583/dataset_583.pq",
    "name": "fri_c1_1000_50",
    "parquet_url": "https://data.openml.org/datasets/0000/0583/dataset_583.pq",
    "processing_date": "2020-11-20 21:08:55",
    "status": "active",
    "tag": [
      "artificial",
      "Machine Learning",
      "Mathematics",
      "Statistics"
    ],
    "upload_date": "2014-10-04T00:54:58",
    "url": "https://api.openml.org/data/v1/download/1390086/fri_c1_1000_50.arff",
    "version": "1",
    "visibility": "public"
  }
}