{
  "data_qualities": {
    "quality": [
      {
        "name": "AutoCorrelation",
        "value": "0.8562715460090162"
      },
      {
        "name": "CfsSubsetEval_DecisionStumpAUC",
        "value": "0.988871524706157"
      },
      {
        "name": "CfsSubsetEval_DecisionStumpErrRate",
        "value": "0.02704135737009544"
      },
      {
        "name": "CfsSubsetEval_DecisionStumpKappa",
        "value": "0.8214494217145025"
      },
      {
        "name": "CfsSubsetEval_NaiveBayesAUC",
        "value": "0.988871524706157"
      },
      {
        "name": "CfsSubsetEval_NaiveBayesErrRate",
        "value": "0.02704135737009544"
      },
      {
        "name": "CfsSubsetEval_NaiveBayesKappa",
        "value": "0.8214494217145025"
      },
      {
        "name": "CfsSubsetEval_kNN1NAUC",
        "value": "0.988871524706157"
      },
      {
        "name": "CfsSubsetEval_kNN1NErrRate",
        "value": "0.02704135737009544"
      },
      {
        "name": "CfsSubsetEval_kNN1NKappa",
        "value": "0.8214494217145025"
      },
      {
        "name": "ClassEntropy",
        "value": "0.46661759698663374"
      },
      {
        "name": "DecisionStumpAUC",
        "value": "0.9844898933771603"
      },
      {
        "name": "DecisionStumpErrRate",
        "value": "0.04612937433722163"
      },
      {
        "name": "DecisionStumpKappa",
        "value": "0.714726078305068"
      },
      {
        "name": "Dimensionality",
        "value": "0.007953340402969246"
      },
      {
        "name": "EquivalentNumberOfAtts",
        "value": "202.5849704152198"
      },
      {
        "name": "J48.00001.AUC",
        "value": "0.9960819087507015"
      },
      {
        "name": "J48.00001.ErrRate",
        "value": "0.005302226935312832"
      },
      {
        "name": "J48.00001.Kappa",
        "value": "0.9636072438179593"
      },
      {
        "name": "J48.0001.AUC",
        "value": "0.9960819087507015"
      },
      {
        "name": "J48.0001.ErrRate",
        "value": "0.005302226935312832"
      },
      {
        "name": "J48.0001.Kappa",
        "value": "0.9636072438179593"
      },
      {
        "name": "J48.001.AUC",
        "value": "0.9960819087507015"
      },
      {
        "name": "J48.001.ErrRate",
        "value": "0.005302226935312832"
      },
      {
        "name": "J48.001.Kappa",
        "value": "0.9636072438179593"
      },
      {
        "name": "MajorityClassPercentage",
        "value": "92.28525980911984"
      },
      {
        "name": "MajorityClassSize",
        "value": "3481.0"
      },
      {
        "name": "MaxAttributeEntropy",
        "value": "1.520689912507409"
      },
      {
        "name": "MaxKurtosisOfNumericAtts",
        "value": "238.1814623780636"
      },
      {
        "name": "MaxMeansOfNumericAtts",
        "value": "110.46964865662825"
      },
      {
        "name": "MaxMutualInformation",
        "value": "0.01195055117111"
      },
      {
        "name": "MaxNominalAttDistinctValues",
        "value": "5.0"
      },
      {
        "name": "MaxSkewnessOfNumericAtts",
        "value": "13.882652755041702"
      },
      {
        "name": "MaxStdDevOfNumericAtts",
        "value": "35.604247607641"
      },
      {
        "name": "MeanAttributeEntropy",
        "value": "0.33755530471128503"
      },
      {
        "name": "MeanKurtosisOfNumericAtts",
        "value": "51.41313506551009"
      },
      {
        "name": "MeanMeansOfNumericAtts",
        "value": "46.43668969641138"
      },
      {
        "name": "MeanMutualInformation",
        "value": "0.0023033179412581817"
      },
      {
        "name": "MeanNoiseToSignalRatio",
        "value": "145.55176285688822"
      },
      {
        "name": "MeanNominalAttDistinctValues",
        "value": "2.1739130434782608"
      },
      {
        "name": "MeanSkewnessOfNumericAtts",
        "value": "3.5691918824691085"
      },
      {
        "name": "MeanStdDevOfNumericAtts",
        "value": "19.05387758896556"
      },
      {
        "name": "MinAttributeEntropy",
        "value": "-0.0"
      },
      {
        "name": "MinKurtosisOfNumericAtts",
        "value": "4.073471498748956"
      },
      {
        "name": "MinMeansOfNumericAtts",
        "value": "0.9949997045790251"
      },
      {
        "name": "MinMutualInformation",
        "value": "0.0"
      },
      {
        "name": "MinNominalAttDistinctValues",
        "value": "1.0"
      },
      {
        "name": "MinSkewnessOfNumericAtts",
        "value": "1.232674238507278"
      },
      {
        "name": "MinStdDevOfNumericAtts",
        "value": "0.19545727511328811"
      },
      {
        "name": "MinorityClassPercentage",
        "value": "0.05302226935312832"
      },
      {
        "name": "MinorityClassSize",
        "value": "2.0"
      },
      {
        "name": "NaiveBayesAUC",
        "value": "0.9342238722214744"
      },
      {
        "name": "NaiveBayesErrRate",
        "value": "0.04665959703075292"
      },
      {
        "name": "NaiveBayesKappa",
        "value": "0.6098333890681739"
      },
      {
        "name": "NumberOfBinaryFeatures",
        "value": "20.0"
      },
      {
        "name": "NumberOfClasses",
        "value": "4.0"
      },
      {
        "name": "NumberOfFeatures",
        "value": "30.0"
      },
      {
        "name": "NumberOfInstances",
        "value": "3772.0"
      },
      {
        "name": "NumberOfInstancesWithMissingValues",
        "value": "3772.0"
      },
      {
        "name": "NumberOfMissingValues",
        "value": "6064.0"
      },
      {
        "name": "NumberOfNumericFeatures",
        "value": "7.0"
      },
      {
        "name": "NumberOfSymbolicFeatures",
        "value": "23.0"
      },
      {
        "name": "PercentageOfBinaryFeatures",
        "value": "66.66666666666666"
      },
      {
        "name": "PercentageOfInstancesWithMissingValues",
        "value": "100.0"
      },
      {
        "name": "PercentageOfMissingValues",
        "value": "5.358784022622834"
      },
      {
        "name": "PercentageOfNumericFeatures",
        "value": "23.333333333333332"
      },
      {
        "name": "PercentageOfSymbolicFeatures",
        "value": "76.66666666666667"
      },
      {
        "name": "Quartile1AttributeEntropy",
        "value": "0.0987401719719687"
      },
      {
        "name": "Quartile1KurtosisOfNumericAtts",
        "value": "5.982197043232063"
      },
      {
        "name": "Quartile1MeansOfNumericAtts",
        "value": "1.7588748012696314"
      },
      {
        "name": "Quartile1MutualInformation",
        "value": "3.6394692046749994E-4"
      },
      {
        "name": "Quartile1SkewnessOfNumericAtts",
        "value": "1.2589465934783108"
      },
      {
        "name": "Quartile1StdDevOfNumericAtts",
        "value": "0.669439962143292"
      },
      {
        "name": "Quartile2AttributeEntropy",
        "value": "0.25937485231702934"
      },
      {
        "name": "Quartile2KurtosisOfNumericAtts",
        "value": "8.87130380657577"
      },
      {
        "name": "Quartile2MeansOfNumericAtts",
        "value": "28.41132258295655"
      },
      {
        "name": "Quartile2MutualInformation",
        "value": "0.001091317700015"
      },
      {
        "name": "Quartile2SkewnessOfNumericAtts",
        "value": "1.5381528946217138"
      },
      {
        "name": "Quartile2StdDevOfNumericAtts",
        "value": "22.3032143933016"
      },
      {
        "name": "Quartile3AttributeEntropy",
        "value": "0.4759318019149815"
      },
      {
        "name": "Quartile3KurtosisOfNumericAtts",
        "value": "90.94248810329343"
      },
      {
        "name": "Quartile3MeansOfNumericAtts",
        "value": "108.85692077754308"
      },
      {
        "name": "Quartile3MutualInformation",
        "value": "0.002305393613935"
      },
      {
        "name": "Quartile3SkewnessOfNumericAtts",
        "value": "4.937524038925616"
      },
      {
        "name": "Quartile3StdDevOfNumericAtts",
        "value": "33.71833515687218"
      },
      {
        "name": "REPTreeDepth1AUC",
        "value": "0.9944985110919476"
      },
      {
        "name": "REPTreeDepth1ErrRate",
        "value": "0.007953340402969246"
      },
      {
        "name": "REPTreeDepth1Kappa",
        "value": "0.946435215295785"
      },
      {
        "name": "REPTreeDepth2AUC",
        "value": "0.9944985110919476"
      },
      {
        "name": "REPTreeDepth2ErrRate",
        "value": "0.007953340402969246"
      },
      {
        "name": "REPTreeDepth2Kappa",
        "value": "0.946435215295785"
      },
      {
        "name": "REPTreeDepth3AUC",
        "value": "0.9944985110919476"
      },
      {
        "name": "REPTreeDepth3ErrRate",
        "value": "0.007953340402969246"
      },
      {
        "name": "REPTreeDepth3Kappa",
        "value": "0.946435215295785"
      },
      {
        "name": "RandomTreeDepth1AUC",
        "value": "0.9107382259055059"
      },
      {
        "name": "RandomTreeDepth1ErrRate",
        "value": "0.03685047720042418"
      },
      {
        "name": "RandomTreeDepth1Kappa",
        "value": "0.7422991986969176"
      },
      {
        "name": "RandomTreeDepth2AUC",
        "value": "0.9107382259055059"
      },
      {
        "name": "RandomTreeDepth2ErrRate",
        "value": "0.03685047720042418"
      },
      {
        "name": "RandomTreeDepth2Kappa",
        "value": "0.7422991986969176"
      },
      {
        "name": "RandomTreeDepth3AUC",
        "value": "0.9107382259055059"
      },
      {
        "name": "RandomTreeDepth3ErrRate",
        "value": "0.03685047720042418"
      },
      {
        "name": "RandomTreeDepth3Kappa",
        "value": "0.7422991986969176"
      },
      {
        "name": "StdvNominalAttDistinctValues",
        "value": "0.7776522892681231"
      },
      {
        "name": "kNN1NAUC",
        "value": "0.6743398856933536"
      },
      {
        "name": "kNN1NErrRate",
        "value": "0.08907741251325557"
      },
      {
        "name": "kNN1NKappa",
        "value": "0.3399787212879303"
      }
    ]
  }
}