{
  "data_qualities": {
    "quality": [
      {
        "name": "AutoCorrelation",
        "value": "0.09564422348890698"
      },
      {
        "name": "CfsSubsetEval_DecisionStumpAUC",
        "value": "0.9299296960617288"
      },
      {
        "name": "CfsSubsetEval_DecisionStumpErrRate",
        "value": "0.13245714285714286"
      },
      {
        "name": "CfsSubsetEval_DecisionStumpKappa",
        "value": "0.8527729816031412"
      },
      {
        "name": "CfsSubsetEval_NaiveBayesAUC",
        "value": "0.9299296960617288"
      },
      {
        "name": "CfsSubsetEval_NaiveBayesErrRate",
        "value": "0.13245714285714286"
      },
      {
        "name": "CfsSubsetEval_NaiveBayesKappa",
        "value": "0.8527729816031412"
      },
      {
        "name": "CfsSubsetEval_kNN1NAUC",
        "value": "0.9299296960617288"
      },
      {
        "name": "CfsSubsetEval_kNN1NErrRate",
        "value": "0.13245714285714286"
      },
      {
        "name": "CfsSubsetEval_kNN1NKappa",
        "value": "0.8527729816031412"
      },
      {
        "name": "ClassEntropy",
        "value": "3.3198370254034137"
      },
      {
        "name": "DecisionStumpAUC",
        "value": "0.6596630958148316"
      },
      {
        "name": "DecisionStumpErrRate",
        "value": "0.7950428571428572"
      },
      {
        "name": "DecisionStumpKappa",
        "value": "0.11052914645302327"
      },
      {
        "name": "Dimensionality",
        "value": "0.011214285714285715"
      },
      {
        "name": "EquivalentNumberOfAtts",
        "value": []
      },
      {
        "name": "J48.00001.AUC",
        "value": "0.932729475291536"
      },
      {
        "name": "J48.00001.ErrRate",
        "value": "0.1268"
      },
      {
        "name": "J48.00001.Kappa",
        "value": "0.8590627479657593"
      },
      {
        "name": "J48.0001.AUC",
        "value": "0.932729475291536"
      },
      {
        "name": "J48.0001.ErrRate",
        "value": "0.1268"
      },
      {
        "name": "J48.0001.Kappa",
        "value": "0.8590627479657593"
      },
      {
        "name": "J48.001.AUC",
        "value": "0.932729475291536"
      },
      {
        "name": "J48.001.ErrRate",
        "value": "0.1268"
      },
      {
        "name": "J48.001.Kappa",
        "value": "0.8590627479657593"
      },
      {
        "name": "MajorityClassPercentage",
        "value": "11.252857142857142"
      },
      {
        "name": "MajorityClassSize",
        "value": "7877.0"
      },
      {
        "name": "MaxAttributeEntropy",
        "value": []
      },
      {
        "name": "MaxKurtosisOfNumericAtts",
        "value": "70000.00000000247"
      },
      {
        "name": "MaxMeansOfNumericAtts",
        "value": "140.01505714285668"
      },
      {
        "name": "MaxMutualInformation",
        "value": []
      },
      {
        "name": "MaxNominalAttDistinctValues",
        "value": "10.0"
      },
      {
        "name": "MaxSkewnessOfNumericAtts",
        "value": "264.57513110807787"
      },
      {
        "name": "MaxStdDevOfNumericAtts",
        "value": "113.88629683929352"
      },
      {
        "name": "MeanAttributeEntropy",
        "value": []
      },
      {
        "name": "MeanKurtosisOfNumericAtts",
        "value": "4894.714442707244"
      },
      {
        "name": "MeanMeansOfNumericAtts",
        "value": "33.38596474125363"
      },
      {
        "name": "MeanMutualInformation",
        "value": []
      },
      {
        "name": "MeanNoiseToSignalRatio",
        "value": []
      },
      {
        "name": "MeanNominalAttDistinctValues",
        "value": "10.0"
      },
      {
        "name": "MeanSkewnessOfNumericAtts",
        "value": "31.079435593429213"
      },
      {
        "name": "MeanStdDevOfNumericAtts",
        "value": "49.25570412611296"
      },
      {
        "name": "MinAttributeEntropy",
        "value": []
      },
      {
        "name": "MinKurtosisOfNumericAtts",
        "value": "-1.8254292785726658"
      },
      {
        "name": "MinMeansOfNumericAtts",
        "value": "0.0"
      },
      {
        "name": "MinMutualInformation",
        "value": []
      },
      {
        "name": "MinNominalAttDistinctValues",
        "value": "10.0"
      },
      {
        "name": "MinSkewnessOfNumericAtts",
        "value": "-0.23549660230998054"
      },
      {
        "name": "MinStdDevOfNumericAtts",
        "value": "0.0"
      },
      {
        "name": "MinorityClassPercentage",
        "value": "9.018571428571429"
      },
      {
        "name": "MinorityClassSize",
        "value": "6313.0"
      },
      {
        "name": "NaiveBayesAUC",
        "value": "0.937306319966156"
      },
      {
        "name": "NaiveBayesErrRate",
        "value": "0.30001428571428573"
      },
      {
        "name": "NaiveBayesKappa",
        "value": "0.6663891986793616"
      },
      {
        "name": "NumberOfBinaryFeatures",
        "value": "0.0"
      },
      {
        "name": "NumberOfClasses",
        "value": "10.0"
      },
      {
        "name": "NumberOfFeatures",
        "value": "785.0"
      },
      {
        "name": "NumberOfInstances",
        "value": "70000.0"
      },
      {
        "name": "NumberOfInstancesWithMissingValues",
        "value": "0.0"
      },
      {
        "name": "NumberOfMissingValues",
        "value": "0.0"
      },
      {
        "name": "NumberOfNumericFeatures",
        "value": "784.0"
      },
      {
        "name": "NumberOfSymbolicFeatures",
        "value": "1.0"
      },
      {
        "name": "PercentageOfBinaryFeatures",
        "value": "0.0"
      },
      {
        "name": "PercentageOfInstancesWithMissingValues",
        "value": "0.0"
      },
      {
        "name": "PercentageOfMissingValues",
        "value": "0.0"
      },
      {
        "name": "PercentageOfNumericFeatures",
        "value": "99.87261146496816"
      },
      {
        "name": "PercentageOfSymbolicFeatures",
        "value": "0.12738853503184713"
      },
      {
        "name": "Quartile1AttributeEntropy",
        "value": []
      },
      {
        "name": "Quartile1KurtosisOfNumericAtts",
        "value": "-1.0297320016722729"
      },
      {
        "name": "Quartile1MeansOfNumericAtts",
        "value": "0.12058214285714541"
      },
      {
        "name": "Quartile1MutualInformation",
        "value": []
      },
      {
        "name": "Quartile1SkewnessOfNumericAtts",
        "value": "0.8744121903751375"
      },
      {
        "name": "Quartile1StdDevOfNumericAtts",
        "value": "4.670545729236738"
      },
      {
        "name": "Quartile2AttributeEntropy",
        "value": []
      },
      {
        "name": "Quartile2KurtosisOfNumericAtts",
        "value": "16.22683706266253"
      },
      {
        "name": "Quartile2MeansOfNumericAtts",
        "value": "7.196049999999809"
      },
      {
        "name": "Quartile2MutualInformation",
        "value": []
      },
      {
        "name": "Quartile2SkewnessOfNumericAtts",
        "value": "4.134907396813174"
      },
      {
        "name": "Quartile2StdDevOfNumericAtts",
        "value": "36.765819161632194"
      },
      {
        "name": "Quartile3AttributeEntropy",
        "value": []
      },
      {
        "name": "Quartile3KurtosisOfNumericAtts",
        "value": "623.0827644398202"
      },
      {
        "name": "Quartile3MeansOfNumericAtts",
        "value": "69.33461785714294"
      },
      {
        "name": "Quartile3MutualInformation",
        "value": []
      },
      {
        "name": "Quartile3SkewnessOfNumericAtts",
        "value": "23.939583112011796"
      },
      {
        "name": "Quartile3StdDevOfNumericAtts",
        "value": "100.84850801763852"
      },
      {
        "name": "REPTreeDepth1AUC",
        "value": "0.9597205371114488"
      },
      {
        "name": "REPTreeDepth1ErrRate",
        "value": "0.14168571428571428"
      },
      {
        "name": "REPTreeDepth1Kappa",
        "value": "0.8425153284961173"
      },
      {
        "name": "REPTreeDepth2AUC",
        "value": "0.9597205371114488"
      },
      {
        "name": "REPTreeDepth2ErrRate",
        "value": "0.14168571428571428"
      },
      {
        "name": "REPTreeDepth2Kappa",
        "value": "0.8425153284961173"
      },
      {
        "name": "REPTreeDepth3AUC",
        "value": "0.9597205371114488"
      },
      {
        "name": "REPTreeDepth3ErrRate",
        "value": "0.14168571428571428"
      },
      {
        "name": "REPTreeDepth3Kappa",
        "value": "0.8425153284961173"
      },
      {
        "name": "RandomTreeDepth1AUC",
        "value": "0.8806813200173884"
      },
      {
        "name": "RandomTreeDepth1ErrRate",
        "value": "0.2150142857142857"
      },
      {
        "name": "RandomTreeDepth1Kappa",
        "value": "0.7610073553514332"
      },
      {
        "name": "RandomTreeDepth2AUC",
        "value": "0.8806813200173884"
      },
      {
        "name": "RandomTreeDepth2ErrRate",
        "value": "0.2150142857142857"
      },
      {
        "name": "RandomTreeDepth2Kappa",
        "value": "0.7610073553514332"
      },
      {
        "name": "RandomTreeDepth3AUC",
        "value": "0.8806813200173884"
      },
      {
        "name": "RandomTreeDepth3ErrRate",
        "value": "0.2150142857142857"
      },
      {
        "name": "RandomTreeDepth3Kappa",
        "value": "0.7610073553514332"
      },
      {
        "name": "StdvNominalAttDistinctValues",
        "value": "0.0"
      },
      {
        "name": "kNN1NAUC",
        "value": "0.9816188217574185"
      },
      {
        "name": "kNN1NErrRate",
        "value": "0.03307142857142857"
      },
      {
        "name": "kNN1NKappa",
        "value": "0.9632397138736942"
      }
    ]
  }
}