{
  "data_features": {
    "feature": [
      {
        "data_type": "nominal",
        "index": "0",
        "is_ignore": "true",
        "is_row_identifier": "false",
        "is_target": "false",
        "name": "Name",
        "nominal_value": [
          "abraham",
          "akaka",
          "allard",
          "ashcroft",
          "baucus",
          "bayh",
          "bennett",
          "biden",
          "bingaman",
          "bkerrey",
          "bobsmith",
          "bond",
          "boxer",
          "breaux",
          "brownbac",
          "bryan",
          "bunning",
          "burns",
          "byrd",
          "campbell",
          "chafee",
          "cleland",
          "cochran",
          "collins",
          "conrad",
          "coverdel",
          "craig",
          "crapo",
          "daschle",
          "dewine",
          "dodd",
          "domenici",
          "dorgan",
          "durbin",
          "edwards",
          "enzi",
          "feingold",
          "feinstei",
          "fitzgera",
          "frist",
          "gorsmith",
          "gorton",
          "graham",
          "gramm",
          "grams",
          "grassley",
          "gregg",
          "hagel",
          "harkin",
          "hatch",
          "helms",
          "hollings",
          "hreid",
          "inhofe",
          "inouye",
          "jackreed",
          "jeffords",
          "jkerry",
          "johnson",
          "kaybhut",
          "kennedy",
          "kohl",
          "kyl",
          "landrieu",
          "lautenbe",
          "leahy",
          "levin",
          "lieberma",
          "lincoln",
          "lott",
          "lugar",
          "mack",
          "mccain",
          "mcconnel",
          "mikulski",
          "moynihan",
          "murkowsk",
          "murray",
          "nickles",
          "robb",
          "roberts",
          "rockefel",
          "roth",
          "santorum",
          "sarbanes",
          "schumer",
          "sessions",
          "shelby",
          "snowe",
          "specter",
          "stevens",
          "thomas",
          "thompson",
          "thurmond",
          "timhutch",
          "torricel",
          "voinovic",
          "warner",
          "wellston",
          "wyden"
        ],
        "number_of_missing_values": "0"
      },
      {
        "data_type": "nominal",
        "index": "1",
        "is_ignore": "false",
        "is_row_identifier": "false",
        "is_target": "false",
        "name": "State",
        "nominal_value": [
          "AK",
          "AL",
          "AR",
          "AZ",
          "CA",
          "CO",
          "CT",
          "DE",
          "FL",
          "GA",
          "HI",
          "IA",
          "ID",
          "IL",
          "IN",
          "KS",
          "KY",
          "LA",
          "MA",
          "MD",
          "ME",
          "MI",
          "MN",
          "MO",
          "MS",
          "MT",
          "NC",
          "ND",
          "NE",
          "NH",
          "NJ",
          "NM",
          "NV",
          "NY",
          "OH",
          "OK",
          "OR",
          "PA",
          "RI",
          "SC",
          "SD",
          "TN",
          "TX",
          "UT",
          "VA",
          "VT",
          "WA",
          "WI",
          "WV",
          "WY"
        ],
        "number_of_missing_values": "0"
      },
      {
        "data_type": "nominal",
        "index": "2",
        "is_ignore": "false",
        "is_row_identifier": "false",
        "is_target": "false",
        "name": "Perjury.guilty",
        "nominal_value": [
          "Guilty",
          "Not_guilty"
        ],
        "number_of_missing_values": "0"
      },
      {
        "data_type": "nominal",
        "index": "3",
        "is_ignore": "false",
        "is_row_identifier": "false",
        "is_target": "false",
        "name": "Obstruction.guilty",
        "nominal_value": [
          "Guilty",
          "Not_guilty"
        ],
        "number_of_missing_values": "0"
      },
      {
        "data_type": "nominal",
        "index": "4",
        "is_ignore": "false",
        "is_row_identifier": "false",
        "is_target": "false",
        "name": "Total.guilty",
        "nominal_value": [
          "0",
          "1",
          "2"
        ],
        "number_of_missing_values": "0"
      },
      {
        "data_type": "nominal",
        "index": "5",
        "is_ignore": "false",
        "is_row_identifier": "false",
        "is_target": "false",
        "name": "Party",
        "nominal_value": [
          "Democrat",
          "Republican"
        ],
        "number_of_missing_values": "0"
      },
      {
        "data_type": "numeric",
        "index": "6",
        "is_ignore": "false",
        "is_row_identifier": "false",
        "is_target": "false",
        "name": "Conservatism",
        "number_of_missing_values": "0"
      },
      {
        "data_type": "numeric",
        "index": "7",
        "is_ignore": "false",
        "is_row_identifier": "false",
        "is_target": "false",
        "name": "Clinton.vote.1996",
        "number_of_missing_values": "0"
      },
      {
        "data_type": "nominal",
        "index": "8",
        "is_ignore": "false",
        "is_row_identifier": "false",
        "is_target": "false",
        "name": "Reelection.year",
        "nominal_value": [
          "2000",
          "2002",
          "2004"
        ],
        "number_of_missing_values": "0"
      },
      {
        "data_type": "nominal",
        "index": "9",
        "is_ignore": "false",
        "is_row_identifier": "false",
        "is_target": "false",
        "name": "First.term",
        "nominal_value": [
          "No",
          "Yes"
        ],
        "number_of_missing_values": "0"
      },
      {
        "data_type": "nominal",
        "index": "10",
        "is_ignore": "false",
        "is_row_identifier": "false",
        "is_target": "false",
        "name": "Won.state.1996",
        "nominal_value": [
          "Clinton",
          "Dole"
        ],
        "number_of_missing_values": "0"
      }
    ]
  }
}