{
  "data_set_description": {
    "citation": "Jeffrey S. Simonoff, Springer-Verlag, New York, 2003",
    "collection_date": "2003",
    "creator": "Jeffrey S. Simonoff",
    "default_target_attribute": "Lugs",
    "description": "**Author**:   \n**Source**: Unknown - Date unknown  \n**Please cite**:   \n\nanalcatdata    A collection of data sets used in the book \"Analyzing Categorical Data,\"\nby Jeffrey S. Simonoff, Springer-Verlag, New York, 2003. The submission\nconsists of a zip file containing two versions of each of 84 data sets,\nplus this README file. Each data set is given in comma-delimited ASCII\n(.csv) form, and Microsoft Excel (.xls) form.\n\nNOTICE: These data sets may be used freely for scientific, educational and/or\nnoncommercial purposes, provided suitable acknowledgment is given (by citing\nthe above-named reference).\n\nFurther details concerning the book, including information on statistical software\n(including sample S-PLUS/R and SAS code), are available at the web site\n\nhttp://www.stern.nyu.edu/~jsimonof/AnalCatData\n\n\nInformation about the dataset\nCLASSTYPE: numeric\nCLASSINDEX: last\n\n\nNote: Quotes, Single-Quotes and Backslashes were removed, Blanks replaced\nwith Underscores",
    "description_version": "1",
    "file_id": "52612",
    "format": "ARFF",
    "id": "500",
    "language": "English",
    "licence": "Public",
    "md5_checksum": "a813c9b25e7b9d8c3bbdd9d19abc2cf8",
    "minio_url": "https://data.openml.org/datasets/0000/0500/dataset_500.pq",
    "name": "analcatdata_vineyard",
    "original_data_url": "http://www.stern.nyu.edu/~jsimonof/AnalCatData",
    "parquet_url": "https://data.openml.org/datasets/0000/0500/dataset_500.pq",
    "processing_date": "2020-11-20 19:47:28",
    "status": "active",
    "upload_date": "2014-09-29T00:06:57",
    "url": "https://api.openml.org/data/v1/download/52612/analcatdata_vineyard.arff",
    "version": "1",
    "visibility": "public"
  }
}