{
  "data_set_description": {
    "citation": "Jeffrey S. Simonoff, Springer-Verlag, New York, 2003",
    "collection_date": "2003",
    "creator": "Jeffrey S. Simonoff",
    "default_target_attribute": "Political_system",
    "description": "**Author**:   \n**Source**: Unknown - Date unknown  \n**Please cite**:   \n\nanalcatdata    A collection of data sets used in the book \"Analyzing Categorical Data,\"\nby Jeffrey S. Simonoff, Springer-Verlag, New York, 2003. The submission\nconsists of a zip file containing two versions of each of 84 data sets,\nplus this README file. Each data set is given in comma-delimited ASCII\n(.csv) form, and Microsoft Excel (.xls) form.\n\nNOTICE: These data sets may be used freely for scientific, educational and/or\nnoncommercial purposes, provided suitable acknowledgment is given (by citing\nthe above-named reference).\n\nFurther details concerning the book, including information on statistical software\n(including sample S-PLUS/R and SAS code), are available at the web site\n\nhttp://www.stern.nyu.edu/~jsimonof/AnalCatData\n\n\nInformation about the dataset\nCLASSTYPE: nominal\nCLASSINDEX: 1\n\n\nNote: Quotes, Single-Quotes and Backslashes were removed, Blanks replaced\nwith Underscores",
    "description_version": "1",
    "file_id": "52587",
    "format": "ARFF",
    "id": "475",
    "language": "English",
    "licence": "Public",
    "md5_checksum": "f2b2e9ceda83838a58673d0174189f35",
    "minio_url": "https://data.openml.org/datasets/0000/0475/dataset_475.pq",
    "name": "analcatdata_germangss",
    "original_data_url": "http://www.stern.nyu.edu/~jsimonof/AnalCatData",
    "parquet_url": "https://data.openml.org/datasets/0000/0475/dataset_475.pq",
    "processing_date": "2020-11-20 20:09:24",
    "status": "active",
    "tag": [
      "Data Science",
      "Education",
      "Information Management",
      "Statistics",
      "study_1",
      "study_127",
      "study_41",
      "study_50",
      "study_52",
      "study_7",
      "study_88"
    ],
    "upload_date": "2014-09-28T23:51:38",
    "url": "https://api.openml.org/data/v1/download/52587/analcatdata_germangss.arff",
    "version": "1",
    "visibility": "public"
  }
}