{
  "data_set_description": {
    "citation": "(a) Shoaib, M. and Bosch, S. and Incel, O.D. and Scholten, H. and Havinga, P.J.M. (2014) Fusion of Smartphone Motion Sensors for Physical Activity Recognition. Sensors, 14, 10146-10176; (b) This data collector is supported by the Dutch national program COMMIT in the context of the SWELL project.",
    "contributor": [
      "Shoaib",
      "M. and Bosch",
      "S. and Incel",
      "O.D. and Scholten",
      "H. and Havinga",
      "P.J.M."
    ],
    "default_target_attribute": "Activity",
    "description": "Dataset of walking, running, sitting, standing, jogging, biking, walking upstairs and walking downstairs activities. \n\nhttp://ps.ewi.utwente.nl/Datasets.php - original link.",
    "description_version": "1",
    "file_id": "1830311",
    "format": "ARFF",
    "id": "4709",
    "licence": "Public",
    "md5_checksum": "151fa14ea34d2474024514594733208c",
    "minio_url": "https://data.openml.org/datasets/0000/4709/dataset_4709.pq",
    "name": "Physical_Activity_Recognition_Dataset_Using_Five_Smartphones",
    "original_data_url": "http://ps.ewi.utwente.nl/Datasets.php",
    "parquet_url": "https://data.openml.org/datasets/0000/4709/dataset_4709.pq",
    "processing_date": "2021-09-16 22:53:40",
    "status": "deactivated",
    "tag": "invalid_ARFF",
    "upload_date": "2016-03-09T16:40:06",
    "url": "https://api.openml.org/data/v1/download/1830311/Physical_Activity_Recognition_Dataset_Using_Five_Smartphones.arff",
    "version": "1",
    "version_label": "2",
    "visibility": "public"
  }
}