{
  "data_features": {
    "feature": [
      {
        "data_type": "nominal",
        "index": "0",
        "is_ignore": "false",
        "is_row_identifier": "false",
        "is_target": "false",
        "name": "id_series",
        "nominal_value": [
          "q1",
          "q10",
          "q100",
          "q101",
          "q102",
          "q103",
          "q104",
          "q105",
          "q106",
          "q107",
          "q108",
          "q109",
          "q11",
          "q110",
          "q111",
          "q112",
          "q113",
          "q114",
          "q115",
          "q116",
          "q117",
          "q118",
          "q119",
          "q12",
          "q120",
          "q121",
          "q122",
          "q123",
          "q124",
          "q125",
          "q126",
          "q127",
          "q128",
          "q129",
          "q13",
          "q130",
          "q131",
          "q132",
          "q133",
          "q134",
          "q135",
          "q136",
          "q137",
          "q138",
          "q139",
          "q14",
          "q140",
          "q141",
          "q142",
          "q143",
          "q144",
          "q145",
          "q146",
          "q147",
          "q148",
          "q149",
          "q15",
          "q150",
          "q151",
          "q152",
          "q153",
          "q154",
          "q155",
          "q156",
          "q157",
          "q158",
          "q159",
          "q16",
          "q160",
          "q161",
          "q162",
          "q163",
          "q164",
          "q165",
          "q166",
          "q167",
          "q168",
          "q169",
          "q17",
          "q170",
          "q171",
          "q172",
          "q173",
          "q174",
          "q175",
          "q176",
          "q177",
          "q178",
          "q179",
          "q18",
          "q180",
          "q181",
          "q182",
          "q183",
          "q184",
          "q185",
          "q186",
          "q187",
          "q188",
          "q189",
          "q19",
          "q190",
          "q191",
          "q192",
          "q193",
          "q194",
          "q195",
          "q196",
          "q197",
          "q198",
          "q199",
          "q2",
          "q20",
          "q200",
          "q201",
          "q202",
          "q203",
          "q204",
          "q205",
          "q206",
          "q207",
          "q208",
          "q209",
          "q21",
          "q210",
          "q211",
          "q212",
          "q213",
          "q214",
          "q215",
          "q216",
          "q217",
          "q218",
          "q219",
          "q22",
          "q220",
          "q221",
          "q222",
          "q223",
          "q224",
          "q225",
          "q226",
          "q227",
          "q228",
          "q229",
          "q23",
          "q230",
          "q231",
          "q232",
          "q233",
          "q234",
          "q235",
          "q236",
          "q237",
          "q238",
          "q239",
          "q24",
          "q240",
          "q241",
          "q242",
          "q243",
          "q244",
          "q245",
          "q246",
          "q247",
          "q248",
          "q249",
          "q25",
          "q250",
          "q251",
          "q252",
          "q253",
          "q254",
          "q255",
          "q256",
          "q257",
          "q258",
          "q259",
          "q26",
          "q260",
          "q261",
          "q262",
          "q263",
          "q264",
          "q265",
          "q266",
          "q267",
          "q268",
          "q269",
          "q27",
          "q270",
          "q271",
          "q272",
          "q273",
          "q274",
          "q275",
          "q276",
          "q277",
          "q278",
          "q279",
          "q28",
          "q280",
          "q281",
          "q282",
          "q283",
          "q284",
          "q285",
          "q286",
          "q287",
          "q288",
          "q289",
          "q29",
          "q290",
          "q291",
          "q292",
          "q293",
          "q294",
          "q295",
          "q296",
          "q297",
          "q298",
          "q299",
          "q3",
          "q30",
          "q300",
          "q301",
          "q302",
          "q303",
          "q304",
          "q305",
          "q306",
          "q307",
          "q308",
          "q309",
          "q31",
          "q310",
          "q311",
          "q312",
          "q313",
          "q314",
          "q315",
          "q316",
          "q317",
          "q318",
          "q319",
          "q32",
          "q320",
          "q321",
          "q322",
          "q323",
          "q324",
          "q325",
          "q326",
          "q327",
          "q328",
          "q329",
          "q33",
          "q330",
          "q331",
          "q332",
          "q333",
          "q334",
          "q335",
          "q336",
          "q337",
          "q338",
          "q339",
          "q34",
          "q340",
          "q341",
          "q342",
          "q343",
          "q344",
          "q345",
          "q346",
          "q347",
          "q348",
          "q349",
          "q35",
          "q350",
          "q351",
          "q352",
          "q353",
          "q354",
          "q355",
          "q356",
          "q357",
          "q358",
          "q359",
          "q36",
          "q360",
          "q361",
          "q362",
          "q363",
          "q364",
          "q365",
          "q366",
          "q367",
          "q368",
          "q369",
          "q37",
          "q370",
          "q371",
          "q372",
          "q373",
          "q374",
          "q375",
          "q376",
          "q377",
          "q378",
          "q379",
          "q38",
          "q380",
          "q381",
          "q382",
          "q383",
          "q384",
          "q385",
          "q386",
          "q387",
          "q388",
          "q389",
          "q39",
          "q390",
          "q391",
          "q392",
          "q393",
          "q394",
          "q395",
          "q396",
          "q397",
          "q398",
          "q399",
          "q4",
          "q40",
          "q400",
          "q401",
          "q402",
          "q403",
          "q404",
          "q405",
          "q406",
          "q407",
          "q408",
          "q409",
          "q41",
          "q410",
          "q411",
          "q412",
          "q413",
          "q414",
          "q415",
          "q416",
          "q417",
          "q418",
          "q419",
          "q42",
          "q420",
          "q421",
          "q422",
          "q423",
          "q424",
          "q425",
          "q426",
          "q427",
          "q43",
          "q44",
          "q45",
          "q46",
          "q47",
          "q48",
          "q49",
          "q5",
          "q50",
          "q51",
          "q52",
          "q53",
          "q54",
          "q55",
          "q56",
          "q57",
          "q58",
          "q59",
          "q6",
          "q60",
          "q61",
          "q62",
          "q63",
          "q64",
          "q65",
          "q66",
          "q67",
          "q68",
          "q69",
          "q7",
          "q70",
          "q71",
          "q72",
          "q73",
          "q74",
          "q75",
          "q76",
          "q77",
          "q78",
          "q79",
          "q8",
          "q80",
          "q81",
          "q82",
          "q83",
          "q84",
          "q85",
          "q86",
          "q87",
          "q88",
          "q89",
          "q9",
          "q90",
          "q91",
          "q92",
          "q93",
          "q94",
          "q95",
          "q96",
          "q97",
          "q98",
          "q99"
        ],
        "number_of_missing_values": "0"
      },
      {
        "data_type": "numeric",
        "index": "1",
        "is_ignore": "false",
        "is_row_identifier": "false",
        "is_target": "false",
        "name": "value_0",
        "number_of_missing_values": "0"
      },
      {
        "data_type": "string",
        "index": "2",
        "is_ignore": "false",
        "is_row_identifier": "false",
        "is_target": "false",
        "name": "date",
        "number_of_missing_values": "0"
      },
      {
        "data_type": "numeric",
        "index": "3",
        "is_ignore": "false",
        "is_row_identifier": "false",
        "is_target": "false",
        "name": "time_step",
        "number_of_missing_values": "0"
      }
    ]
  }
}