{
  "data_set_description": {
    "default_target_attribute": "Class",
    "description": "**flare** dataset from the **KEEL** repository: https://sci2s.ugr.es/keel/category.php?cat=clas",
    "description_version": "1",
    "file_id": "22120625",
    "format": "arff",
    "id": "46179",
    "licence": "Public",
    "md5_checksum": "f13e51fc24282674532e2f46228dc894",
    "minio_url": "https://data.openml.org/datasets/0004/46179/dataset_46179.pq",
    "name": "Flare",
    "parquet_url": "https://data.openml.org/datasets/0004/46179/dataset_46179.pq",
    "processing_date": "2024-06-10 20:07:07",
    "status": "active",
    "upload_date": "2024-06-10T20:01:39",
    "url": "https://api.openml.org/data/v1/download/22120625/Flare.arff",
    "version": "6",
    "visibility": "public"
  }
}