{
  "data_set_description": {
    "citation": "David W Hosmer Jr, Stanley Lemeshow, and Susanne May. Applied survival analysis: regression modeling of time-to-event data. Vol. 618. John Wiley & Sons, 2011",
    "default_target_attribute": "time",
    "description": "Dataset whas from R package 'mlr3proba'",
    "description_version": "1",
    "file_id": "22120613",
    "format": "arff",
    "id": "46169",
    "licence": "Publicly available",
    "md5_checksum": "af45e1db164fceb6c6ad28c445d983cf",
    "minio_url": "https://data.openml.org/datasets/0004/46169/dataset_46169.pq",
    "name": "whas",
    "parquet_url": "https://data.openml.org/datasets/0004/46169/dataset_46169.pq",
    "processing_date": "2024-06-07 16:46:23",
    "status": "active",
    "upload_date": "2024-06-07T16:41:10",
    "url": "https://api.openml.org/data/v1/download/22120613/whas.arff",
    "version": "1",
    "visibility": "public"
  }
}