{
  "data_features": {
    "feature": [
      {
        "data_type": "nominal",
        "index": "0",
        "is_ignore": "false",
        "is_row_identifier": "false",
        "is_target": "false",
        "name": "model",
        "nominal_value": [
          "HGST HDS5C4040ALE630",
          "HGST HDS724040ALE640",
          "HGST HMS5C4040ALE640",
          "HGST HMS5C4040BLE640",
          "HGST HUH728080ALE600",
          "Hitachi HDS5C3030ALA630",
          "Hitachi HDS5C3030BLE630",
          "Hitachi HDS5C4040ALE630",
          "Hitachi HDS722020ALA330",
          "Hitachi HDS723020BLA642",
          "Hitachi HDS723030ALA640",
          "Hitachi HDS723030BLE640",
          "Hitachi HDS724040ALE640",
          "Hitachi HDT721010SLA360",
          "Hitachi HDT725025VLA380",
          "SAMSUNG HD103UJ",
          "SAMSUNG HD154UI",
          "ST1500DL001",
          "ST1500DL003",
          "ST1500DM003",
          "ST2000DL001",
          "ST2000DL003",
          "ST2000DM001",
          "ST2000VN000",
          "ST250LM004 HN",
          "ST250LT007",
          "ST3000DM001",
          "ST31500341AS",
          "ST31500541AS",
          "ST3160316AS",
          "ST3160318AS",
          "ST32000542AS",
          "ST320005XXXX",
          "ST320LT007",
          "ST33000651AS",
          "ST3500320AS",
          "ST4000DM000",
          "ST4000DX000",
          "ST500LM012 HN",
          "ST6000DX000",
          "ST9250315AS",
          "ST9320325AS",
          "TOSHIBA DT01ACA300",
          "TOSHIBA MD04ABA400V",
          "TOSHIBA MD04ABA500V",
          "WDC WD1001FALS",
          "WDC WD10EACS",
          "WDC WD10EADS",
          "WDC WD10EADX",
          "WDC WD10EALS",
          "WDC WD10EARS",
          "WDC WD10EARX",
          "WDC WD15EADS",
          "WDC WD15EARS",
          "WDC WD1600AAJB",
          "WDC WD1600AAJS",
          "WDC WD1600BPVT",
          "WDC WD20EFRX",
          "WDC WD2500AAJB",
          "WDC WD2500AAJS",
          "WDC WD2500BEVT",
          "WDC WD2500BPVT",
          "WDC WD2500JB",
          "WDC WD30EFRX",
          "WDC WD30EZRS",
          "WDC WD30EZRX",
          "WDC WD3200AAJB",
          "WDC WD3200AAJS",
          "WDC WD3200AAKS",
          "WDC WD3200BEKT",
          "WDC WD3200BEKX",
          "WDC WD3200LPVX",
          "WDC WD40EFRX",
          "WDC WD5000AAJS",
          "WDC WD5000BPKT",
          "WDC WD5000LPVX",
          "WDC WD5002ABYS",
          "WDC WD5003ABYX",
          "WDC WD60EFRX",
          "WDC WD800AAJB",
          "WDC WD800AAJS",
          "WDC WD800BB",
          "WDC WD800JB",
          "WDC WD800JD",
          "WDC WD800LB"
        ],
        "number_of_missing_values": "0"
      },
      {
        "data_type": "numeric",
        "index": "1",
        "is_ignore": "false",
        "is_row_identifier": "false",
        "is_target": "true",
        "name": "time",
        "number_of_missing_values": "0"
      },
      {
        "data_type": "numeric",
        "index": "2",
        "is_ignore": "false",
        "is_row_identifier": "false",
        "is_target": "false",
        "name": "status",
        "number_of_missing_values": "0"
      },
      {
        "data_type": "numeric",
        "index": "3",
        "is_ignore": "false",
        "is_row_identifier": "false",
        "is_target": "false",
        "name": "temp",
        "number_of_missing_values": "0"
      },
      {
        "data_type": "numeric",
        "index": "4",
        "is_ignore": "false",
        "is_row_identifier": "false",
        "is_target": "false",
        "name": "rsc",
        "number_of_missing_values": "0"
      },
      {
        "data_type": "numeric",
        "index": "5",
        "is_ignore": "false",
        "is_row_identifier": "false",
        "is_target": "false",
        "name": "rer",
        "number_of_missing_values": "0"
      },
      {
        "data_type": "numeric",
        "index": "6",
        "is_ignore": "false",
        "is_row_identifier": "false",
        "is_target": "false",
        "name": "psc",
        "number_of_missing_values": "0"
      }
    ]
  }
}