{
  "data_qualities": {
    "quality": [
      {
        "name": "AutoCorrelation",
        "value": "-124.53676470588235"
      },
      {
        "name": "Dimensionality",
        "value": "0.058394160583941604"
      },
      {
        "name": "MajorityClassPercentage",
        "value": []
      },
      {
        "name": "MajorityClassSize",
        "value": []
      },
      {
        "name": "MinorityClassPercentage",
        "value": []
      },
      {
        "name": "MinorityClassSize",
        "value": []
      },
      {
        "name": "NumberOfBinaryFeatures",
        "value": "2.0"
      },
      {
        "name": "NumberOfClasses",
        "value": "0.0"
      },
      {
        "name": "NumberOfFeatures",
        "value": "8.0"
      },
      {
        "name": "NumberOfInstances",
        "value": "137.0"
      },
      {
        "name": "NumberOfInstancesWithMissingValues",
        "value": "0.0"
      },
      {
        "name": "NumberOfMissingValues",
        "value": "0.0"
      },
      {
        "name": "NumberOfNumericFeatures",
        "value": "5.0"
      },
      {
        "name": "NumberOfSymbolicFeatures",
        "value": "3.0"
      },
      {
        "name": "PercentageOfBinaryFeatures",
        "value": "25.0"
      },
      {
        "name": "PercentageOfInstancesWithMissingValues",
        "value": "0.0"
      },
      {
        "name": "PercentageOfMissingValues",
        "value": "0.0"
      },
      {
        "name": "PercentageOfNumericFeatures",
        "value": "62.5"
      },
      {
        "name": "PercentageOfSymbolicFeatures",
        "value": "37.5"
      }
    ]
  }
}