{
  "data_set_description": {
    "citation": "John P Klein and Melvin L Moeschberger. Survival analysis: techniques for censored and truncated data. 2nd ed. Springer Science & Business Media, 2003. ISBN: 0387216456.",
    "default_target_attribute": "time",
    "description": "Dataset channing from R package 'KMsurv'",
    "description_version": "1",
    "file_id": "22120598",
    "format": "arff",
    "id": "46154",
    "licence": "Publicly available",
    "md5_checksum": "2a36e99ffc5cca167d7b05b1ce297287",
    "minio_url": "https://data.openml.org/datasets/0004/46154/dataset_46154.pq",
    "name": "channing",
    "parquet_url": "https://data.openml.org/datasets/0004/46154/dataset_46154.pq",
    "processing_date": "2024-06-07 16:12:12",
    "status": "active",
    "upload_date": "2024-06-07T16:11:41",
    "url": "https://api.openml.org/data/v1/download/22120598/channing.arff",
    "version": "1",
    "visibility": "public"
  }
}