{
  "data_set_description": {
    "citation": "David W Hosmer, Stanley Lemeshow, and Susanne May. Applied survival analysis regression modeling of time-to-event data. eng. 2nd ed. Wiley series in probability and statistics. Hoboken, N.J.: Wiley-Interscience, 2008.",
    "default_target_attribute": "time",
    "description": "Dataset uis from R package 'quantreg'",
    "description_version": "1",
    "file_id": "22120597",
    "format": "arff",
    "id": "46153",
    "licence": "Publicly available",
    "md5_checksum": "dfd2ba4db1248d8dbf0c1b43f83ead3c",
    "minio_url": "https://data.openml.org/datasets/0004/46153/dataset_46153.pq",
    "name": "uis",
    "parquet_url": "https://data.openml.org/datasets/0004/46153/dataset_46153.pq",
    "processing_date": "2024-06-07 16:11:36",
    "status": "active",
    "upload_date": "2024-06-07T16:10:44",
    "url": "https://api.openml.org/data/v1/download/22120597/uis.arff",
    "version": "1",
    "visibility": "public"
  }
}