{
  "data_set_description": {
    "citation": "https://doi.org/10.24432/C5NC77",
    "creator": [
      "I. H. Witten",
      "E. Frank",
      "M. A. Hall",
      "and ITPro"
    ],
    "default_target_attribute": "Risk",
    "description": "An extract of the well-known UCI German Credit Risk Dataset with 10 features and one target class",
    "description_version": "2",
    "file_id": "22120560",
    "format": "arff",
    "id": "46116",
    "language": "English",
    "licence": "Public",
    "md5_checksum": "62b7ca7d2ce2f2ecaa4effe0ef748937",
    "minio_url": "https://data.openml.org/datasets/0004/46116/dataset_46116.pq",
    "name": "German-Credit-Risk-with-Target",
    "original_data_url": "https://www.kaggle.com/datasets/kabure/german-credit-data-with-risk",
    "parquet_url": "https://data.openml.org/datasets/0004/46116/dataset_46116.pq",
    "processing_date": "2024-06-02 12:58:25",
    "status": "active",
    "upload_date": "2024-06-02T12:57:58",
    "url": "https://api.openml.org/data/v1/download/22120560/German-Credit-Risk-with-Target.arff",
    "version": "1",
    "visibility": "public"
  }
}