{
  "data_set_description": {
    "citation": "https://www.kaggle.com/datasets/fahadrehman07/retail-transaction-dataset",
    "collection_date": "01-05-2024",
    "contributor": "Fahad Rehman",
    "creator": "None",
    "description": "Description:\nThe Retail_Transaction_Dataset.csv provides a comprehensive overview of various retail transactions, capturing customer behavior, product details, and purchase information. It includes data on customer and product identifiers, quantity and price of items purchased, date and time of transaction, payment methods, store locations, product categories, discounts applied, and the total amount of each transaction. This dataset is formatted in CSV, facilitating ease of use for analysis and reporting purposes.\n\nAttribute Description:\n1. CustomerID: Unique numeric identifier for customers (e.g., 770728, 151136).\n2. ProductID: Alphabetic identifier for products ('A', 'B', 'C').\n3. Quantity: Numeric value representing the number of items purchased (e.g., 7, 5).\n4. Price: Numeric value indicating the price of a single item in a transaction, in USD (e.g., 78.11, 72.39).\n5. TransactionDate: Date and time of the transaction ('MM/DD/YYYY HH:MM').\n6. PaymentMethod: Mode of payment used for the transaction ('Cash', 'Debit Card', 'PayPal').\n7. StoreLocation: Address of the store where the transaction occurred.\n8. ProductCategory: Category of the product purchased ('Home Decor', 'Books', 'Clothing').\n9. DiscountApplied(%): Percentage of discount applied to the transaction.\n10. TotalAmount: Total amount paid for the transaction, in USD, after discount.\n\nUse Case:\nThe Retail_Transaction_Dataset.csv is an invaluable resource for retail analysis, providing insights into customer purchasing patterns, product popularity, seasonal trends in sales, and effectiveness of discount strategies. It can be utilized by data analysts and marketing professionals to optimize inventory management, develop targeted promotions, and implement dynamic pricing strategies to enhance customer satisfaction and maximize profitability. Additionally, the dataset supports academic research in consumer behavior and retail analytics.",
    "description_version": "1",
    "file_id": "22120528",
    "format": "arff",
    "id": "46084",
    "language": "English",
    "licence": "Attribution-NonCommercial-NoDerivs (CC BY-NC-ND)",
    "md5_checksum": "b008cf5c75e6f675562c0c85de727805",
    "minio_url": "https://data.openml.org/datasets/0004/46084/dataset_46084.pq",
    "name": "Retail_Transaction_Dataset",
    "parquet_url": "https://data.openml.org/datasets/0004/46084/dataset_46084.pq",
    "processing_date": "2024-05-31 13:50:05",
    "status": "active",
    "upload_date": "2024-05-31T13:49:35",
    "url": "https://api.openml.org/data/v1/download/22120528/Retail_Transaction_Dataset.arff",
    "version": "1",
    "visibility": "public"
  }
}