{
  "data_set_description": {
    "collection_date": "01 March 2024",
    "creator": "Romain Mussard",
    "default_target_attribute": "CATEGORY",
    "description": "100 Sports Dataset",
    "description_version": "1",
    "file_id": "22120511",
    "format": "arff",
    "id": "46068",
    "language": "English",
    "licence": "Type license() to see the full license text",
    "md5_checksum": "a741b8d85f5ab922407de9991fea451c",
    "minio_url": "https://data.openml.org/datasets/0004/46068/dataset_46068.pq",
    "name": "Stylized_Meta_Album_SPT_Extended",
    "parquet_url": "https://data.openml.org/datasets/0004/46068/dataset_46068.pq",
    "processing_date": "2024-05-29 11:02:02",
    "status": "active",
    "upload_date": "2024-05-29T11:01:58",
    "url": "https://api.openml.org/data/v1/download/22120511/Stylized_Meta_Album_SPT_Extended.arff",
    "version": "1",
    "version_label": "v1.0",
    "visibility": "public"
  }
}