{
  "data_set_description": {
    "collection_date": "01 March 2024",
    "creator": "Romain Mussard",
    "default_target_attribute": "CATEGORY",
    "description": "Dogs dataset with different breeds of dogs",
    "description_version": "1",
    "file_id": "22120482",
    "format": "arff",
    "id": "46039",
    "language": "English",
    "licence": "Type license() to see the full license text",
    "md5_checksum": "b8d03c12d37589639690fd6a01aaed52",
    "minio_url": "https://data.openml.org/datasets/0004/46039/dataset_46039.pq",
    "name": "Stylized_Meta_Album_DOG_Extended",
    "parquet_url": "https://data.openml.org/datasets/0004/46039/dataset_46039.pq",
    "processing_date": "2024-05-29 10:54:03",
    "status": "active",
    "upload_date": "2024-05-29T10:53:54",
    "url": "https://api.openml.org/data/v1/download/22120482/Stylized_Meta_Album_DOG_Extended.arff",
    "version": "1",
    "version_label": "v1.0",
    "visibility": "public"
  }
}