{
  "data_set_description": {
    "collection_date": "01 March 2024",
    "creator": "Romain Mussard",
    "default_target_attribute": "CATEGORY",
    "description": "Birds dataset for image classification (stylized)",
    "description_version": "1",
    "file_id": "22120476",
    "format": "arff",
    "id": "46033",
    "language": "English",
    "licence": "Type license() to see the full license text",
    "md5_checksum": "8da0f9a46bb2b2c48706b03fc2792607",
    "minio_url": "https://data.openml.org/datasets/0004/46033/dataset_46033.pq",
    "name": "Stylized_Meta_Album_BRD_STY_Extended",
    "parquet_url": "https://data.openml.org/datasets/0004/46033/dataset_46033.pq",
    "processing_date": "2024-05-29 10:53:04",
    "status": "active",
    "upload_date": "2024-05-29T10:52:56",
    "url": "https://api.openml.org/data/v1/download/22120476/Stylized_Meta_Album_BRD_STY_Extended.arff",
    "version": "1",
    "version_label": "v1.0",
    "visibility": "public"
  }
}