{
  "data_set_description": {
    "citation": "A. Zaman, S. Endow, M. A. N. Rakib, and C. Torres, BraidFlow: A Flow-annotated Dataset of Kumihimo Braidmaking Activity. Proceedings of the 2023 ACM Designing Interactive Systems Conference. 2023.",
    "collection_date": "2022-06-01",
    "creator": "A. Zaman, S. Endow, M. A. N. Rakib, and C. Torres",
    "default_target_attribute": "flow_state",
    "description": "Entering a cognitive state of flow is a natural response of the mind that allows people to fully concentrate and cope with tedious, and often repetitive tasks. Understanding how to trigger or sustain flow remains limited by retrospective surveys, presenting a need to better document flow. This dataset is used to study flow in the context of a flow-inducing task, i.e., braidmaking. Using an instrumented Kumihimo braidmaking tool and off-the-shelf biosignal wristbands, we record the experiences of 24 users engaged in 3 different braidmaking tasks. We extract feature motivated from flow literature from activity data (IMU, EMG, EDA, heart rate, skin temperature, braiding telemetry) and annotated with Flow Short Scale (FSS) scores.Unlike the BraidFlow (BF) dataset, this dataset provides session level data -- specifically features were computing on a sliding window (10 seconds, 50\\% overlap).",
    "description_version": "1",
    "file_id": "22120411",
    "format": "arff",
    "id": "45968",
    "language": "English",
    "licence": "CC-BY-SA",
    "md5_checksum": "a3e26aa344f60d71f6d7b893a3a1a520",
    "minio_url": "https://data.openml.org/datasets/0004/45968/dataset_45968.pq",
    "name": "BraidFlowSessionLevel",
    "parquet_url": "https://data.openml.org/datasets/0004/45968/dataset_45968.pq",
    "processing_date": "2024-05-17 22:27:23",
    "status": "active",
    "upload_date": "2024-05-17T22:26:51",
    "url": "https://api.openml.org/data/v1/download/22120411/BraidFlowSessionLevel.arff",
    "version": "1",
    "version_label": "v1",
    "visibility": "public"
  }
}