{
  "data_set_description": {
    "citation": "None",
    "collection_date": "06-11-2023",
    "contributor": "None",
    "creator": "Mann S",
    "description": "Description:\nThe dataset, named \"clean_tweet_Dec19ToDec20.csv,\" comprises a collection of tweets post-processed for clarity and analysis, spanning from December 2019 to December 2020. It is designed to provide insights into public sentiment during this period, capturing a unique blend of personal and societal narratives emerging from various global circumstances, including the COVID-19 pandemic. This dataset is structured into columns that include an index for unique identification, the raw text of each tweet, and a sentiment score.\n\nAttribute Description:\n- Index: A numerical identifier assigned to each tweet, e.g., 98655, 59794.\n- Text: Contains the cleaned and processed text of the tweet. This column captures a wide range of topics, from personal appliance purchases and mental health advice to discussions on electricity waste, unemployment, and even cryptocurrency-related dietary suggestions.\n- Sentiment: A numerical sentiment score assigned to each tweet, where 0 indicates a negative sentiment and 1 indicates a positive sentiment. This binary classification assists in sentiment analysis, offering a simplistic yet effective insight into the general mood of each tweet.\n\nUse Case:\nThis dataset can be instrumental for researchers and data scientists focusing on natural language processing (NLP), sentiment analysis, and trend spotting. It offers a rich resource for training machine learning models aimed at understanding public sentiment, detecting shifts in societal concerns or interests over time, and exploring the correlation between external events and public mood. Additionally, marketing professionals might leverage this dataset to gauge consumer sentiment, optimize brand communication strategies, and identify potential areas for product or service improvements based on public feedback.",
    "description_version": "1",
    "file_id": "22120405",
    "format": "arff",
    "id": "45962",
    "language": "English",
    "licence": "Attribution (CC BY)",
    "md5_checksum": "16158fd69b03b86370efdb64749faa17",
    "minio_url": "https://data.openml.org/datasets/0004/45962/dataset_45962.pq",
    "name": "(Non-)depressive_tweet_data",
    "parquet_url": "https://data.openml.org/datasets/0004/45962/dataset_45962.pq",
    "processing_date": "2024-05-15 14:56:57",
    "status": "active",
    "upload_date": "2024-05-15T14:55:24",
    "url": "https://api.openml.org/data/v1/download/22120405/(Non-)depressive_tweet_data.arff",
    "version": "2",
    "visibility": "public"
  }
}