{
  "data_qualities": {
    "quality": [
      {
        "name": "AutoCorrelation",
        "value": "1.0"
      },
      {
        "name": "Dimensionality",
        "value": "0.025034947261405514"
      },
      {
        "name": "MajorityClassPercentage",
        "value": "9.492947007243615"
      },
      {
        "name": "MajorityClassSize",
        "value": "747.0"
      },
      {
        "name": "MinorityClassPercentage",
        "value": "8.298386071927819"
      },
      {
        "name": "MinorityClassSize",
        "value": "653.0"
      },
      {
        "name": "NumberOfBinaryFeatures",
        "value": "0.0"
      },
      {
        "name": "NumberOfClasses",
        "value": "11.0"
      },
      {
        "name": "NumberOfFeatures",
        "value": "197.0"
      },
      {
        "name": "NumberOfInstances",
        "value": "7869.0"
      },
      {
        "name": "NumberOfInstancesWithMissingValues",
        "value": "7869.0"
      },
      {
        "name": "NumberOfMissingValues",
        "value": "612770.0"
      },
      {
        "name": "NumberOfNumericFeatures",
        "value": "196.0"
      },
      {
        "name": "NumberOfSymbolicFeatures",
        "value": "0.0"
      },
      {
        "name": "PercentageOfBinaryFeatures",
        "value": "0.0"
      },
      {
        "name": "PercentageOfInstancesWithMissingValues",
        "value": "100.0"
      },
      {
        "name": "PercentageOfMissingValues",
        "value": "39.52862643554706"
      },
      {
        "name": "PercentageOfNumericFeatures",
        "value": "99.49238578680203"
      },
      {
        "name": "PercentageOfSymbolicFeatures",
        "value": "0.0"
      }
    ]
  }
}