{
  "data_qualities": {
    "quality": [
      {
        "name": "AutoCorrelation",
        "value": "1.0"
      },
      {
        "name": "Dimensionality",
        "value": "4.319752637322663E-4"
      },
      {
        "name": "MajorityClassPercentage",
        "value": "9.150145507457257"
      },
      {
        "name": "MajorityClassSize",
        "value": "20123.0"
      },
      {
        "name": "MinorityClassPercentage",
        "value": "9.020552928337578"
      },
      {
        "name": "MinorityClassSize",
        "value": "19838.0"
      },
      {
        "name": "NumberOfBinaryFeatures",
        "value": "0.0"
      },
      {
        "name": "NumberOfClasses",
        "value": "11.0"
      },
      {
        "name": "NumberOfFeatures",
        "value": "95.0"
      },
      {
        "name": "NumberOfInstances",
        "value": "219920.0"
      },
      {
        "name": "NumberOfInstancesWithMissingValues",
        "value": "0.0"
      },
      {
        "name": "NumberOfMissingValues",
        "value": "0.0"
      },
      {
        "name": "NumberOfNumericFeatures",
        "value": "94.0"
      },
      {
        "name": "NumberOfSymbolicFeatures",
        "value": "0.0"
      },
      {
        "name": "PercentageOfBinaryFeatures",
        "value": "0.0"
      },
      {
        "name": "PercentageOfInstancesWithMissingValues",
        "value": "0.0"
      },
      {
        "name": "PercentageOfMissingValues",
        "value": "0.0"
      },
      {
        "name": "PercentageOfNumericFeatures",
        "value": "98.94736842105263"
      },
      {
        "name": "PercentageOfSymbolicFeatures",
        "value": "0.0"
      }
    ]
  }
}