{
  "data_qualities": {
    "quality": [
      {
        "name": "AutoCorrelation",
        "value": "1.0"
      },
      {
        "name": "Dimensionality",
        "value": "5.684065971543292E-4"
      },
      {
        "name": "MajorityClassPercentage",
        "value": "9.26548225889329"
      },
      {
        "name": "MajorityClassSize",
        "value": "20376.0"
      },
      {
        "name": "MinorityClassPercentage",
        "value": "9.030389290310259"
      },
      {
        "name": "MinorityClassSize",
        "value": "19859.0"
      },
      {
        "name": "NumberOfBinaryFeatures",
        "value": "0.0"
      },
      {
        "name": "NumberOfClasses",
        "value": "11.0"
      },
      {
        "name": "NumberOfFeatures",
        "value": "125.0"
      },
      {
        "name": "NumberOfInstances",
        "value": "219913.0"
      },
      {
        "name": "NumberOfInstancesWithMissingValues",
        "value": "219912.0"
      },
      {
        "name": "NumberOfMissingValues",
        "value": "6597360.0"
      },
      {
        "name": "NumberOfNumericFeatures",
        "value": "124.0"
      },
      {
        "name": "NumberOfSymbolicFeatures",
        "value": "0.0"
      },
      {
        "name": "PercentageOfBinaryFeatures",
        "value": "0.0"
      },
      {
        "name": "PercentageOfInstancesWithMissingValues",
        "value": "99.99954527472228"
      },
      {
        "name": "PercentageOfMissingValues",
        "value": "23.999890865933345"
      },
      {
        "name": "PercentageOfNumericFeatures",
        "value": "99.2"
      },
      {
        "name": "PercentageOfSymbolicFeatures",
        "value": "0.0"
      }
    ]
  }
}