{
  "data_set_description": {
    "collection_date": "11/10/2023",
    "creator": "Sebastian Fischer",
    "default_target_attribute": "class",
    "description": "See [https://github.com/slds-lmu/paper_2023_ci_for_ge](https://github.com/slds-lmu/paper_2023_ci_for_ge) for a description.",
    "description_version": "1",
    "file_id": "22117185",
    "format": "arff",
    "id": "45693",
    "language": "English",
    "licence": "CC BY 4.0",
    "md5_checksum": "0dc5ea57007d40c590684c66191791e9",
    "minio_url": "https://data.openml.org/datasets/0004/45693/dataset_45693.pq",
    "name": "simulated_electricity",
    "parquet_url": "https://data.openml.org/datasets/0004/45693/dataset_45693.pq",
    "processing_date": "2023-11-10 09:42:54",
    "status": "active",
    "upload_date": "2023-11-10T09:36:50",
    "url": "https://api.openml.org/data/v1/download/22117185/simulated_electricity.arff",
    "version": "3",
    "visibility": "public"
  }
}