{
  "data_set_description": {
    "collection_date": "11/10/2023",
    "creator": "Sebastian Fischer",
    "default_target_attribute": "Y",
    "description": "See [https://github.com/slds-lmu/paper_2023_ci_for_ge](https://github.com/slds-lmu/paper_2023_ci_for_ge) for a description.",
    "description_version": "1",
    "file_id": "22117183",
    "format": "arff",
    "id": "45691",
    "language": "English",
    "licence": "CC BY 4.0",
    "md5_checksum": "906a3135df45f25d2f3e85f606db753f",
    "minio_url": "https://data.openml.org/datasets/0004/45691/dataset_45691.pq",
    "name": "simulated_covertype",
    "parquet_url": "https://data.openml.org/datasets/0004/45691/dataset_45691.pq",
    "processing_date": "2023-11-10 09:37:04",
    "status": "active",
    "upload_date": "2023-11-10T09:34:11",
    "url": "https://api.openml.org/data/v1/download/22117183/simulated_covertype.arff",
    "version": "3",
    "visibility": "public"
  }
}