{
  "data_qualities": {
    "quality": [
      {
        "name": "AutoCorrelation",
        "value": "0.7946093714920336"
      },
      {
        "name": "Dimensionality",
        "value": "3.3333333333333333E-6"
      },
      {
        "name": "MajorityClassPercentage",
        "value": []
      },
      {
        "name": "MajorityClassSize",
        "value": []
      },
      {
        "name": "MinorityClassPercentage",
        "value": []
      },
      {
        "name": "MinorityClassSize",
        "value": []
      },
      {
        "name": "NumberOfBinaryFeatures",
        "value": "3.0"
      },
      {
        "name": "NumberOfClasses",
        "value": "0.0"
      },
      {
        "name": "NumberOfFeatures",
        "value": "17.0"
      },
      {
        "name": "NumberOfInstances",
        "value": "5100000.0"
      },
      {
        "name": "NumberOfInstancesWithMissingValues",
        "value": "76.0"
      },
      {
        "name": "NumberOfMissingValues",
        "value": "76.0"
      },
      {
        "name": "NumberOfNumericFeatures",
        "value": "8.0"
      },
      {
        "name": "NumberOfSymbolicFeatures",
        "value": "9.0"
      },
      {
        "name": "PercentageOfBinaryFeatures",
        "value": "17.647058823529413"
      },
      {
        "name": "PercentageOfInstancesWithMissingValues",
        "value": "0.0014901960784313726"
      },
      {
        "name": "PercentageOfMissingValues",
        "value": "8.765859284890427E-5"
      },
      {
        "name": "PercentageOfNumericFeatures",
        "value": "47.05882352941176"
      },
      {
        "name": "PercentageOfSymbolicFeatures",
        "value": "52.94117647058824"
      }
    ]
  }
}