{
  "data_set_description": {
    "default_target_attribute": "play",
    "description": "The weather problem is a tiny dataset that we will use repeatedly to illustrate machine learning methods. Entirely fictitious, it supposedly concerns the conditions that are suitable for playing some unspecified game. In general, instances in a dataset are characterized by the values of features, or attributes, that measure different aspects of the instance. In this case there are four attributes: outlook, temperature, humidity, and windy. The outcome is whether to play or not.",
    "description_version": "1",
    "file_id": "22117084",
    "format": "arff",
    "id": "45627",
    "licence": "Public",
    "md5_checksum": "f13dbfb7166622595044726ed79cabb3",
    "minio_url": "https://data.openml.org/datasets/0004/45627/dataset_45627.pq",
    "name": "Weather",
    "parquet_url": "https://data.openml.org/datasets/0004/45627/dataset_45627.pq",
    "processing_date": "2023-08-08 11:39:02",
    "status": "active",
    "upload_date": "2023-08-08T11:38:16",
    "url": "https://api.openml.org/data/v1/download/22117084/Weather.arff",
    "version": "51",
    "visibility": "public"
  }
}