{
  "data_set_description": {
    "collection_date": "3-04-2019",
    "creator": "Banco Santander",
    "default_target_attribute": "target",
    "description": "**Author**: Banco Santander  \n**Source**: Unknown - 3-04-2019  \n**Please cite**: Unknown\n\nAt Santander our mission is to help people and businesses prosper. We are always looking for ways to help our customers understand their financial health and identify which products and services might help them achieve their monetary goals. Our data science team is continually challenging our machine learning algorithms, working with the global data science community to make sure we can more accurately identify new ways to solve our most common challenge, binary classification problems such as: is a customer satisfied? Will a customer buy this product? Can a customer pay this loan?\n\n**Dataset taken from Kaggle** https://www.kaggle.com/c/santander-customer-transaction-prediction/data",
    "description_version": "1",
    "file_id": "22116544",
    "format": "arff",
    "id": "45566",
    "language": "English",
    "licence": "Public",
    "md5_checksum": "1f0ee8e64c82381ad44ed7cdda897cb6",
    "minio_url": "https://data.openml.org/datasets/0004/45566/dataset_45566.pq",
    "name": "SantanderCustomerSatisfaction",
    "parquet_url": "https://data.openml.org/datasets/0004/45566/dataset_45566.pq",
    "processing_date": "2023-06-06 17:27:16",
    "status": "active",
    "upload_date": "2023-06-06T17:25:27",
    "url": "https://api.openml.org/data/v1/download/22116544/SantanderCustomerSatisfaction.arff",
    "version": "3",
    "visibility": "public"
  }
}