{
  "data_qualities": {
    "quality": [
      {
        "name": "AutoCorrelation",
        "value": "1.0"
      },
      {
        "name": "Dimensionality",
        "value": "0.006253439391665416"
      },
      {
        "name": "MajorityClassPercentage",
        "value": "9.395167342038121"
      },
      {
        "name": "MajorityClassSize",
        "value": "1878.0"
      },
      {
        "name": "MinorityClassPercentage",
        "value": "8.714793136224925"
      },
      {
        "name": "MinorityClassSize",
        "value": "1742.0"
      },
      {
        "name": "NumberOfBinaryFeatures",
        "value": "0.0"
      },
      {
        "name": "NumberOfClasses",
        "value": "11.0"
      },
      {
        "name": "NumberOfFeatures",
        "value": "125.0"
      },
      {
        "name": "NumberOfInstances",
        "value": "19989.0"
      },
      {
        "name": "NumberOfInstancesWithMissingValues",
        "value": "0.0"
      },
      {
        "name": "NumberOfMissingValues",
        "value": "0.0"
      },
      {
        "name": "NumberOfNumericFeatures",
        "value": "124.0"
      },
      {
        "name": "NumberOfSymbolicFeatures",
        "value": "0.0"
      },
      {
        "name": "PercentageOfBinaryFeatures",
        "value": "0.0"
      },
      {
        "name": "PercentageOfInstancesWithMissingValues",
        "value": "0.0"
      },
      {
        "name": "PercentageOfMissingValues",
        "value": "0.0"
      },
      {
        "name": "PercentageOfNumericFeatures",
        "value": "99.2"
      },
      {
        "name": "PercentageOfSymbolicFeatures",
        "value": "0.0"
      }
    ]
  }
}