{
  "data_qualities": {
    "quality": [
      {
        "name": "AutoCorrelation",
        "value": "1.0"
      },
      {
        "name": "Dimensionality",
        "value": "0.005683885049108767"
      },
      {
        "name": "MajorityClassPercentage",
        "value": "9.389778101127682"
      },
      {
        "name": "MajorityClassSize",
        "value": "2065.0"
      },
      {
        "name": "MinorityClassPercentage",
        "value": "8.871407784648962"
      },
      {
        "name": "MinorityClassSize",
        "value": "1951.0"
      },
      {
        "name": "NumberOfBinaryFeatures",
        "value": "0.0"
      },
      {
        "name": "NumberOfClasses",
        "value": "11.0"
      },
      {
        "name": "NumberOfFeatures",
        "value": "125.0"
      },
      {
        "name": "NumberOfInstances",
        "value": "21992.0"
      },
      {
        "name": "NumberOfInstancesWithMissingValues",
        "value": "0.0"
      },
      {
        "name": "NumberOfMissingValues",
        "value": "0.0"
      },
      {
        "name": "NumberOfNumericFeatures",
        "value": "124.0"
      },
      {
        "name": "NumberOfSymbolicFeatures",
        "value": "0.0"
      },
      {
        "name": "PercentageOfBinaryFeatures",
        "value": "0.0"
      },
      {
        "name": "PercentageOfInstancesWithMissingValues",
        "value": "0.0"
      },
      {
        "name": "PercentageOfMissingValues",
        "value": "0.0"
      },
      {
        "name": "PercentageOfNumericFeatures",
        "value": "99.2"
      },
      {
        "name": "PercentageOfSymbolicFeatures",
        "value": "0.0"
      }
    ]
  }
}