{
  "data_qualities": {
    "quality": [
      {
        "name": "AutoCorrelation",
        "value": "1.0"
      },
      {
        "name": "Dimensionality",
        "value": "0.01250250050010002"
      },
      {
        "name": "MajorityClassPercentage",
        "value": "9.591918383676736"
      },
      {
        "name": "MajorityClassSize",
        "value": "959.0"
      },
      {
        "name": "MinorityClassPercentage",
        "value": "8.431686337267454"
      },
      {
        "name": "MinorityClassSize",
        "value": "843.0"
      },
      {
        "name": "NumberOfBinaryFeatures",
        "value": "0.0"
      },
      {
        "name": "NumberOfClasses",
        "value": "11.0"
      },
      {
        "name": "NumberOfFeatures",
        "value": "125.0"
      },
      {
        "name": "NumberOfInstances",
        "value": "9998.0"
      },
      {
        "name": "NumberOfInstancesWithMissingValues",
        "value": "0.0"
      },
      {
        "name": "NumberOfMissingValues",
        "value": "0.0"
      },
      {
        "name": "NumberOfNumericFeatures",
        "value": "124.0"
      },
      {
        "name": "NumberOfSymbolicFeatures",
        "value": "0.0"
      },
      {
        "name": "PercentageOfBinaryFeatures",
        "value": "0.0"
      },
      {
        "name": "PercentageOfInstancesWithMissingValues",
        "value": "0.0"
      },
      {
        "name": "PercentageOfMissingValues",
        "value": "0.0"
      },
      {
        "name": "PercentageOfNumericFeatures",
        "value": "99.2"
      },
      {
        "name": "PercentageOfSymbolicFeatures",
        "value": "0.0"
      }
    ]
  }
}