{
  "data_set_description": {
    "default_target_attribute": "ln_votes_pop",
    "description": "**Data Description**\n\nThe dataset contains 3,107 observations on U.S. county votes cast in the 1980 presidential election.\n\nGiven population, education levels in the population, number of owned houses, incomes and coordinates, the goal is to predict the number of votes per population (logarithmic).\n\n**Attribute Description**\n\n1. *ln_votes_pop* - logarithm of total number of votes - logarithm of populaiton (ln(votes/pop)), target feature\n2. *pop* - the population in each county of 18 years of age or older\n3. *education* - the population in each county with a 12th grade or higher education\n4. *houses* - the number of owner-occupied housing units\n5. *income* - the aggregate income\n6. *xcoord* - X spatial coordinate of the county\n7. *ycoord* - Y spatial coordinate of the county",
    "description_version": "1",
    "file_id": "22116370",
    "format": "arff",
    "id": "45402",
    "licence": "Public",
    "md5_checksum": "920d059f61c6d88d34c653bdbdd04f26",
    "minio_url": "https://data.openml.org/datasets/0004/45402/dataset_45402.pq",
    "name": "space_ga",
    "original_data_url": "https://www.openml.org/search?type=data&sort=runs&id=507&status=active",
    "paper_url": "https://onlinelibrary.wiley.com/doi/abs/10.1111/j.1538-4632.1997.tb00959.x",
    "parquet_url": "https://data.openml.org/datasets/0004/45402/dataset_45402.pq",
    "processing_date": "2023-05-26 10:51:03",
    "status": "active",
    "upload_date": "2023-05-26T10:50:05",
    "url": "https://api.openml.org/data/v1/download/22116370/space_ga.arff",
    "version": "5",
    "visibility": "public"
  }
}