{
  "data_set_description": {
    "citation": "@Article{asano21pass, author = Yuki M. Asano and Christian Rupprecht and Andrew Zisserman and Andrea Vedaldi, title = PASS: An ImageNet replacement for self-supervised pretraining without humans, journal = NeurIPS Track on Datasets and Benchmarks,year = 2021}",
    "collection_date": "June 8, 2021",
    "contributor": "Asano, Yuki Markus; Rupprecht, Christian; Zisserman, Andrew; Vedaldi, Andrea",
    "creator": "Asano, Yuki Markus; Rupprecht, Christian; Zisserman, Andrew; Vedaldi, Andrea",
    "default_target_attribute": "unickname",
    "description": "PASS is a large-scale image dataset that does not include any humans and which can be used for high-quality pretraining while significantly reducing privacy concerns. Upload by OpenML team.",
    "description_version": "1",
    "file_id": "22116152",
    "format": "arff",
    "id": "45274",
    "language": "English",
    "licence": "CC BY",
    "md5_checksum": "5500b324ef8a43504f21cfbaec119254",
    "minio_url": "https://data.openml.org/datasets/0004/45274/dataset_45274.pq",
    "name": "PASS",
    "original_data_url": "https://www.robots.ox.ac.uk/~vgg/data/pass/",
    "paper_url": "https://datasets-benchmarks-proceedings.neurips.cc/paper_files/paper/2021/hash/0777d5c17d4066b82ab86dff8a46af6f-Abstract-round1.html",
    "parquet_url": "https://data.openml.org/datasets/0004/45274/dataset_45274.pq",
    "processing_date": "2023-05-15 15:01:10",
    "row_id_attribute": "index",
    "status": "active",
    "upload_date": "2023-05-15T14:58:47",
    "url": "https://api.openml.org/data/v1/download/22116152/PASS.arff",
    "version": "1",
    "visibility": "public"
  }
}