{
  "data_qualities": {
    "quality": [
      {
        "name": "AutoCorrelation",
        "value": "1.0"
      },
      {
        "name": "Dimensionality",
        "value": "4.862502327054685E-6"
      },
      {
        "name": "MajorityClassPercentage",
        "value": "0.005557145516633926"
      },
      {
        "name": "MajorityClassSize",
        "value": "80.0"
      },
      {
        "name": "MinorityClassPercentage",
        "value": "6.946431895792406E-5"
      },
      {
        "name": "MinorityClassSize",
        "value": "1.0"
      },
      {
        "name": "NumberOfBinaryFeatures",
        "value": "0.0"
      },
      {
        "name": "NumberOfClasses",
        "value": "94137.0"
      },
      {
        "name": "NumberOfFeatures",
        "value": "7.0"
      },
      {
        "name": "NumberOfInstances",
        "value": "1439588.0"
      },
      {
        "name": "NumberOfInstancesWithMissingValues",
        "value": "887733.0"
      },
      {
        "name": "NumberOfMissingValues",
        "value": "1775490.0"
      },
      {
        "name": "NumberOfNumericFeatures",
        "value": "2.0"
      },
      {
        "name": "NumberOfSymbolicFeatures",
        "value": "0.0"
      },
      {
        "name": "PercentageOfBinaryFeatures",
        "value": "0.0"
      },
      {
        "name": "PercentageOfInstancesWithMissingValues",
        "value": "61.66576826147481"
      },
      {
        "name": "PercentageOfMissingValues",
        "value": "17.61902909522923"
      },
      {
        "name": "PercentageOfNumericFeatures",
        "value": "28.57142857142857"
      },
      {
        "name": "PercentageOfSymbolicFeatures",
        "value": "0.0"
      }
    ]
  }
}