{
  "data_set_description": {
    "contributor": "OpenML",
    "description": "**Pigs Bayesian Network. Sample 0.**\n\nbnlearn Bayesian Network Repository reference: [URL](https://www.bnlearn.com/bnrepository/discrete-verylarge.html#pigs)\n\n- Number of nodes: 441\n\n- Number of arcs: 592\n\n- Number of parameters: 5618\n\n- Average Markov blanket size: 3.66\n\n- Average degree: 2.68\n\n- Maximum in-degree: 2",
    "description_version": "1",
    "file_id": "22115914",
    "format": "arff",
    "id": "45252",
    "licence": "Public",
    "md5_checksum": "04629d4136262a7c5ade50e971cf83cc",
    "minio_url": "https://data.openml.org/datasets/0004/45252/dataset_45252.pq",
    "name": "pigs_0",
    "original_data_url": "https://www.bnlearn.com/bnrepository/discrete-verylarge.html#pigs",
    "paper_url": "https://www.bnlearn.com/bnrepository/discrete-verylarge.html#pigs",
    "parquet_url": "https://data.openml.org/datasets/0004/45252/dataset_45252.pq",
    "processing_date": "2023-04-26 17:09:04",
    "status": "active",
    "tag": [
      "bnlearn",
      "Data Science",
      "Machine Learning",
      "Mathematics",
      "pigs",
      "sample",
      "Statistics"
    ],
    "upload_date": "2023-04-26T17:08:47",
    "url": "https://api.openml.org/data/v1/download/22115914/pigs_0.arff",
    "version": "1",
    "visibility": "public"
  }
}