{
  "data_set_description": {
    "citation": "C. S. Jensen and A. Kong. Blocking Gibbs Sampling for Linkage Analysis in Large Pedigrees with Many Loops. The American Journal of Human Genetics, 65(3):885-901, 1999. Also, Research Report R-96-2048, Department of Computer Science, Aalborg University, 1996.",
    "collection_date": "1992",
    "contributor": "OpenML",
    "creator": "D. Heckerman, E. Horwitz, and B. Nathwani.",
    "description": "**Pathfinder Bayesian Network. Sample 2.**\n\nbnlearn Bayesian Network Repository reference: [URL](https://www.bnlearn.com/bnrepository/discrete-verylarge.html#pathfinder)\n\n- Number of nodes: 109\n\n- Number of arcs: 195\n\n- Number of parameters: 72079\n\n- Average Markov blanket size: 3.82\n\n- Average degree: 3.58\n\n- Maximum in-degree: 5\n\n**Authors**: D. Heckerman, E. Horwitz, and B. Nathwani.\n\n**Please cite**: ([URL](https://pubmed.ncbi.nlm.nih.gov/1635470/)): D. Heckerman, E. Horwitz, and B. Nathwani. Towards Normative Expert Systems: Part I. The Pathfinder Project. Methods of Information in Medicine, 31:90-105, 1992.",
    "description_version": "2",
    "file_id": "22115905",
    "format": "arff",
    "id": "45243",
    "licence": "Public",
    "md5_checksum": "b74cd742a5733e7c7955c733c27e48f8",
    "minio_url": "https://data.openml.org/datasets/0004/45243/dataset_45243.pq",
    "name": "pathfinder_2",
    "original_data_url": "https://www.bnlearn.com/bnrepository/discrete-verylarge.html#pathfinder",
    "paper_url": "https://pubmed.ncbi.nlm.nih.gov/1635470/",
    "parquet_url": "https://data.openml.org/datasets/0004/45243/dataset_45243.pq",
    "processing_date": "2023-04-26 17:07:19",
    "status": "active",
    "tag": [
      "AI",
      "bnlearn",
      "Data Science",
      "Machine Learning",
      "pathfinder",
      "sample",
      "Statistics"
    ],
    "upload_date": "2023-04-26T17:06:30",
    "url": "https://api.openml.org/data/v1/download/22115905/pathfinder_2.arff",
    "version": "1",
    "visibility": "public"
  }
}