{
  "data_set_description": {
    "citation": "C. S. Jensen and A. Kong. Blocking Gibbs Sampling for Linkage Analysis in Large Pedigrees with Many Loops. The American Journal of Human Genetics, 65(3):885-901, 1999. Also, Research Report R-96-2048, Department of Computer Science, Aalborg University, 1996.",
    "collection_date": "1996",
    "contributor": "OpenML",
    "creator": "C. S. Jensen and A. Kong.",
    "description": "**Link Bayesian Network. Sample 8.**\n\nbnlearn Bayesian Network Repository reference: [URL](https://www.bnlearn.com/bnrepository/discrete-verylarge.html#link)\n\n- Number of nodes: 724\n\n- Number of arcs: 1125\n\n- Number of parameters: 14211\n\n- Average Markov blanket size: 4.8\n\n- Average degree: 3.11\n\n- Maximum in-degree: 3\n\n**Authors**: C. S. Jensen and A. Kong.\n\n**Please cite**: ([URL](https://pubmed.ncbi.nlm.nih.gov/10441593/)): C. S. Jensen and A. Kong. Blocking Gibbs Sampling for Linkage Analysis in Large Pedigrees with Many Loops. The American Journal of Human Genetics, 65(3):885-901, 1999. Also, Research Report R-96-2048, Department of Computer Science, Aalborg University, 1996.",
    "description_version": "1",
    "file_id": "22115900",
    "format": "arff",
    "id": "45238",
    "licence": "Public",
    "md5_checksum": "8952a2a2f3fc9250569db67375ba17de",
    "minio_url": "https://data.openml.org/datasets/0004/45238/dataset_45238.pq",
    "name": "link_8",
    "original_data_url": "https://www.bnlearn.com/bnrepository/discrete-verylarge.html#link",
    "paper_url": "https://pubmed.ncbi.nlm.nih.gov/10441593/",
    "parquet_url": "https://data.openml.org/datasets/0004/45238/dataset_45238.pq",
    "processing_date": "2023-04-26 17:06:11",
    "status": "active",
    "tag": [
      "bnlearn",
      "Computer Science",
      "Data Analysis",
      "link",
      "Machine Learning",
      "Research",
      "sample",
      "Statistics"
    ],
    "upload_date": "2023-04-26T17:05:51",
    "url": "https://api.openml.org/data/v1/download/22115900/link_8.arff",
    "version": "1",
    "visibility": "public"
  }
}