{
  "data_set_description": {
    "citation": "J. Binder, D. Koller, S. Russell, and K. Kanazawa. Adaptive Probabilistic Networks with Hidden Variables. Machine Learning, 29(2-3):213-244, 1997.",
    "collection_date": "1997",
    "contributor": "OpenML",
    "creator": "J. Binder, D. Koller, S. Russell, and K. Kanazawa",
    "description": "**Insurance Bayesian Network. Sample 3.**\n\nbnlearn Bayesian Network Repository reference: [URL](https://www.bnlearn.com/bnrepository/discrete-medium.html#insurance)\n\n- Number of nodes: 27\n\n- Number of arcs: 52\n\n- Number of parameters: 1008\n\n- Average Markov blanket size: 5.19\n\n- Average degree: 3.85\n\n- Maximum in-degree: 3\n\n**Authors**: J. Binder, D. Koller, S. Russell, and K. Kanazawa\n\n**Please cite**: ([URL](https://cse.sc.edu/~mgv/csce582sp21/links/SDLC_CHILD_1993.pdf)): J. Binder, D. Koller, S. Russell, and K. Kanazawa. Adaptive Probabilistic Networks with Hidden Variables. Machine Learning, 29(2-3):213-244, 1997.",
    "description_version": "1",
    "file_id": "22115807",
    "format": "arff",
    "id": "45145",
    "licence": "Public",
    "md5_checksum": "aaf30ea7877627ca237d24b6970f2507",
    "minio_url": "https://data.openml.org/datasets/0004/45145/dataset_45145.pq",
    "name": "insurance_3",
    "original_data_url": "https://www.bnlearn.com/bnrepository/discrete-medium.html#insurance",
    "paper_url": "https://cse.sc.edu/~mgv/csce582sp21/links/SDLC_CHILD_1993.pdf",
    "parquet_url": "https://data.openml.org/datasets/0004/45145/dataset_45145.pq",
    "processing_date": "2023-04-26 16:44:23",
    "status": "active",
    "tag": [
      "bnlearn",
      "Finance",
      "insurance",
      "Machine Learning",
      "sample",
      "Statistics"
    ],
    "upload_date": "2023-04-26T16:43:24",
    "url": "https://api.openml.org/data/v1/download/22115807/insurance_3.arff",
    "version": "1",
    "visibility": "public"
  }
}