{
  "data_features": {
    "feature": [
      {
        "data_type": "string",
        "index": "0",
        "is_ignore": "false",
        "is_row_identifier": "false",
        "is_target": "false",
        "name": "tkvs",
        "number_of_missing_values": "0"
      },
      {
        "data_type": "string",
        "index": "1",
        "is_ignore": "false",
        "is_row_identifier": "false",
        "is_target": "false",
        "name": "tkv",
        "number_of_missing_values": "0"
      },
      {
        "data_type": "string",
        "index": "2",
        "is_ignore": "false",
        "is_row_identifier": "false",
        "is_target": "false",
        "name": "aks_m2",
        "number_of_missing_values": "0"
      },
      {
        "data_type": "string",
        "index": "3",
        "is_ignore": "false",
        "is_row_identifier": "false",
        "is_target": "false",
        "name": "udb",
        "number_of_missing_values": "0"
      },
      {
        "data_type": "string",
        "index": "4",
        "is_ignore": "false",
        "is_row_identifier": "false",
        "is_target": "false",
        "name": "protein",
        "number_of_missing_values": "0"
      },
      {
        "data_type": "string",
        "index": "5",
        "is_ignore": "false",
        "is_row_identifier": "false",
        "is_target": "false",
        "name": "sort",
        "number_of_missing_values": "0"
      },
      {
        "data_type": "string",
        "index": "6",
        "is_ignore": "false",
        "is_row_identifier": "false",
        "is_target": "false",
        "name": "srtsize",
        "number_of_missing_values": "0"
      },
      {
        "data_type": "string",
        "index": "7",
        "is_ignore": "false",
        "is_row_identifier": "false",
        "is_target": "false",
        "name": "dgv1059",
        "number_of_missing_values": "0"
      },
      {
        "data_type": "string",
        "index": "8",
        "is_ignore": "false",
        "is_row_identifier": "false",
        "is_target": "false",
        "name": "nedbarea",
        "number_of_missing_values": "0"
      },
      {
        "data_type": "string",
        "index": "9",
        "is_ignore": "false",
        "is_row_identifier": "false",
        "is_target": "false",
        "name": "srtprot",
        "number_of_missing_values": "0"
      },
      {
        "data_type": "string",
        "index": "10",
        "is_ignore": "false",
        "is_row_identifier": "false",
        "is_target": "false",
        "name": "ngodnn",
        "number_of_missing_values": "0"
      },
      {
        "data_type": "string",
        "index": "11",
        "is_ignore": "false",
        "is_row_identifier": "false",
        "is_target": "false",
        "name": "dgv5980",
        "number_of_missing_values": "0"
      },
      {
        "data_type": "string",
        "index": "12",
        "is_ignore": "false",
        "is_row_identifier": "false",
        "is_target": "false",
        "name": "forfrugt",
        "number_of_missing_values": "0"
      },
      {
        "data_type": "string",
        "index": "13",
        "is_ignore": "false",
        "is_row_identifier": "false",
        "is_target": "false",
        "name": "spndx",
        "number_of_missing_values": "0"
      },
      {
        "data_type": "string",
        "index": "14",
        "is_ignore": "false",
        "is_row_identifier": "false",
        "is_target": "false",
        "name": "sorttkv",
        "number_of_missing_values": "0"
      },
      {
        "data_type": "string",
        "index": "15",
        "is_ignore": "false",
        "is_row_identifier": "false",
        "is_target": "false",
        "name": "aks_vgt",
        "number_of_missing_values": "0"
      },
      {
        "data_type": "string",
        "index": "16",
        "is_ignore": "false",
        "is_row_identifier": "false",
        "is_target": "false",
        "name": "s2225",
        "number_of_missing_values": "0"
      },
      {
        "data_type": "string",
        "index": "17",
        "is_ignore": "false",
        "is_row_identifier": "false",
        "is_target": "false",
        "name": "saamng",
        "number_of_missing_values": "0"
      },
      {
        "data_type": "string",
        "index": "18",
        "is_ignore": "false",
        "is_row_identifier": "false",
        "is_target": "false",
        "name": "saatid",
        "number_of_missing_values": "0"
      },
      {
        "data_type": "string",
        "index": "19",
        "is_ignore": "false",
        "is_row_identifier": "false",
        "is_target": "false",
        "name": "saakern",
        "number_of_missing_values": "0"
      },
      {
        "data_type": "string",
        "index": "20",
        "is_ignore": "false",
        "is_row_identifier": "false",
        "is_target": "false",
        "name": "komm",
        "number_of_missing_values": "0"
      },
      {
        "data_type": "string",
        "index": "21",
        "is_ignore": "false",
        "is_row_identifier": "false",
        "is_target": "false",
        "name": "exptgens",
        "number_of_missing_values": "0"
      },
      {
        "data_type": "string",
        "index": "22",
        "is_ignore": "false",
        "is_row_identifier": "false",
        "is_target": "false",
        "name": "pesticid",
        "number_of_missing_values": "0"
      },
      {
        "data_type": "string",
        "index": "23",
        "is_ignore": "false",
        "is_row_identifier": "false",
        "is_target": "false",
        "name": "nopt",
        "number_of_missing_values": "0"
      },
      {
        "data_type": "string",
        "index": "24",
        "is_ignore": "false",
        "is_row_identifier": "false",
        "is_target": "false",
        "name": "nmin",
        "number_of_missing_values": "0"
      },
      {
        "data_type": "string",
        "index": "25",
        "is_ignore": "false",
        "is_row_identifier": "false",
        "is_target": "false",
        "name": "aar_mod",
        "number_of_missing_values": "0"
      },
      {
        "data_type": "string",
        "index": "26",
        "is_ignore": "false",
        "is_row_identifier": "false",
        "is_target": "false",
        "name": "frspdag",
        "number_of_missing_values": "0"
      },
      {
        "data_type": "string",
        "index": "27",
        "is_ignore": "false",
        "is_row_identifier": "false",
        "is_target": "false",
        "name": "ngodnt",
        "number_of_missing_values": "0"
      },
      {
        "data_type": "string",
        "index": "28",
        "is_ignore": "false",
        "is_row_identifier": "false",
        "is_target": "false",
        "name": "mod_nmin",
        "number_of_missing_values": "0"
      },
      {
        "data_type": "string",
        "index": "29",
        "is_ignore": "false",
        "is_row_identifier": "false",
        "is_target": "false",
        "name": "rokap",
        "number_of_missing_values": "0"
      },
      {
        "data_type": "string",
        "index": "30",
        "is_ignore": "false",
        "is_row_identifier": "false",
        "is_target": "false",
        "name": "slt22",
        "number_of_missing_values": "0"
      },
      {
        "data_type": "string",
        "index": "31",
        "is_ignore": "false",
        "is_row_identifier": "false",
        "is_target": "false",
        "name": "jordinf",
        "number_of_missing_values": "0"
      },
      {
        "data_type": "string",
        "index": "32",
        "is_ignore": "false",
        "is_row_identifier": "false",
        "is_target": "false",
        "name": "bgbyg",
        "number_of_missing_values": "0"
      },
      {
        "data_type": "string",
        "index": "33",
        "is_ignore": "false",
        "is_row_identifier": "false",
        "is_target": "false",
        "name": "jordn",
        "number_of_missing_values": "0"
      },
      {
        "data_type": "string",
        "index": "34",
        "is_ignore": "false",
        "is_row_identifier": "false",
        "is_target": "false",
        "name": "nprot",
        "number_of_missing_values": "0"
      },
      {
        "data_type": "string",
        "index": "35",
        "is_ignore": "false",
        "is_row_identifier": "false",
        "is_target": "false",
        "name": "jordtype",
        "number_of_missing_values": "0"
      },
      {
        "data_type": "string",
        "index": "36",
        "is_ignore": "false",
        "is_row_identifier": "false",
        "is_target": "false",
        "name": "nplac",
        "number_of_missing_values": "0"
      },
      {
        "data_type": "string",
        "index": "37",
        "is_ignore": "false",
        "is_row_identifier": "false",
        "is_target": "false",
        "name": "partigerm",
        "number_of_missing_values": "0"
      },
      {
        "data_type": "string",
        "index": "38",
        "is_ignore": "false",
        "is_row_identifier": "false",
        "is_target": "false",
        "name": "markgrm",
        "number_of_missing_values": "0"
      },
      {
        "data_type": "string",
        "index": "39",
        "is_ignore": "false",
        "is_row_identifier": "false",
        "is_target": "false",
        "name": "ntilg",
        "number_of_missing_values": "0"
      },
      {
        "data_type": "string",
        "index": "40",
        "is_ignore": "false",
        "is_row_identifier": "false",
        "is_target": "false",
        "name": "ksort",
        "number_of_missing_values": "0"
      },
      {
        "data_type": "string",
        "index": "41",
        "is_ignore": "false",
        "is_row_identifier": "false",
        "is_target": "false",
        "name": "dg25",
        "number_of_missing_values": "0"
      },
      {
        "data_type": "string",
        "index": "42",
        "is_ignore": "false",
        "is_row_identifier": "false",
        "is_target": "false",
        "name": "ngtilg",
        "number_of_missing_values": "0"
      },
      {
        "data_type": "string",
        "index": "43",
        "is_ignore": "false",
        "is_row_identifier": "false",
        "is_target": "false",
        "name": "antplnt",
        "number_of_missing_values": "0"
      },
      {
        "data_type": "string",
        "index": "44",
        "is_ignore": "false",
        "is_row_identifier": "false",
        "is_target": "false",
        "name": "keraks",
        "number_of_missing_values": "0"
      },
      {
        "data_type": "string",
        "index": "45",
        "is_ignore": "false",
        "is_row_identifier": "false",
        "is_target": "false",
        "name": "potnmin",
        "number_of_missing_values": "0"
      },
      {
        "data_type": "string",
        "index": "46",
        "is_ignore": "false",
        "is_row_identifier": "false",
        "is_target": "false",
        "name": "s2528",
        "number_of_missing_values": "0"
      },
      {
        "data_type": "string",
        "index": "47",
        "is_ignore": "false",
        "is_row_identifier": "false",
        "is_target": "false",
        "name": "ngodn",
        "number_of_missing_values": "0"
      }
    ]
  }
}