{
  "data_set_description": {
    "citation": "I. A. Beinlich, H. J. Suermondt, R. M. Chavez, and G. F. Cooper. The ALARM Monitoring System: A Case Study with Two Probabilistic Inference Techniques for Belief Networks. In Proceedings of the 2nd European Conference on Artificial Intelligence in Medicine, pages 247-256. Springer-Verlag, 1989.",
    "collection_date": "1989",
    "contributor": "OpenML",
    "creator": "I. A. Beinlich, H. J. Suermondt, R. M. Chavez, and G. F. Cooper",
    "description": "**Alarm Bayesian Network. Sample 8.**\n\nbnlearn Bayesian Network Repository reference: [URL](https://www.bnlearn.com/bnrepository/discrete-medium.html#alarm)\n\n- Number of nodes: 37\n\n- Number of arcs: 46\n\n- Number of parameters: 509\n\n- Average Markov blanket size: 3.51\n\n- Average degree: 2.49\n\n- Maximum in-degree: 4\n\n**Authors**: I. A. Beinlich, H. J. Suermondt, R. M. Chavez, and G. F. Cooper\n\n**Please cite**: ([URL](https://doi.org/10.1007/978-3-642-93437-7_28)): I. A. Beinlich, H. J. Suermondt, R. M. Chavez, and G. F. Cooper. The ALARM Monitoring System: A Case Study with Two Probabilistic Inference Techniques for Belief Networks. In Proceedings of the 2nd European Conference on Artificial Intelligence in Medicine, pages 247-256. Springer-Verlag, 1989.",
    "description_version": "3",
    "file_id": "22115779",
    "format": "arff",
    "id": "45117",
    "licence": "Public",
    "md5_checksum": "364b720b4aa0f6f3e1ce685291bc5617",
    "minio_url": "https://data.openml.org/datasets/0004/45117/dataset_45117.pq",
    "name": "alarm_8",
    "original_data_url": "https://www.bnlearn.com/bnrepository/discrete-medium.html#alarm",
    "paper_url": "https://www.scopus.com/record/display.uri?eid=2-s2.0-0035845531&origin=inward",
    "parquet_url": "https://data.openml.org/datasets/0004/45117/dataset_45117.pq",
    "processing_date": "2023-04-26 16:07:11",
    "status": "active",
    "tag": [
      "alarm",
      "Artificial Intelligence",
      "bnlearn",
      "Data Science",
      "Healthcare",
      "sample"
    ],
    "upload_date": "2023-04-26T16:06:32",
    "url": "https://api.openml.org/data/v1/download/22115779/alarm_8.arff",
    "version": "1",
    "visibility": "public"
  }
}