{
  "data_features": {
    "feature": [
      {
        "data_type": "nominal",
        "index": "0",
        "is_ignore": "false",
        "is_row_identifier": "false",
        "is_target": "false",
        "name": "DISCONNECT",
        "nominal_value": [
          "True",
          "False"
        ],
        "number_of_missing_values": "0"
      },
      {
        "data_type": "nominal",
        "index": "1",
        "is_ignore": "false",
        "is_row_identifier": "false",
        "is_target": "false",
        "name": "INSUFFANESTH",
        "nominal_value": [
          "True",
          "False"
        ],
        "number_of_missing_values": "0"
      },
      {
        "data_type": "string",
        "index": "2",
        "is_ignore": "false",
        "is_row_identifier": "false",
        "is_target": "false",
        "name": "PAP",
        "number_of_missing_values": "0"
      },
      {
        "data_type": "nominal",
        "index": "3",
        "is_ignore": "false",
        "is_row_identifier": "false",
        "is_target": "false",
        "name": "HISTORY",
        "nominal_value": [
          "True",
          "False"
        ],
        "number_of_missing_values": "0"
      },
      {
        "data_type": "string",
        "index": "4",
        "is_ignore": "false",
        "is_row_identifier": "false",
        "is_target": "false",
        "name": "ARTCO2",
        "number_of_missing_values": "0"
      },
      {
        "data_type": "nominal",
        "index": "5",
        "is_ignore": "false",
        "is_row_identifier": "false",
        "is_target": "false",
        "name": "ERRCAUTER",
        "nominal_value": [
          "True",
          "False"
        ],
        "number_of_missing_values": "0"
      },
      {
        "data_type": "string",
        "index": "6",
        "is_ignore": "false",
        "is_row_identifier": "false",
        "is_target": "false",
        "name": "HRBP",
        "number_of_missing_values": "0"
      },
      {
        "data_type": "string",
        "index": "7",
        "is_ignore": "false",
        "is_row_identifier": "false",
        "is_target": "false",
        "name": "PRESS",
        "number_of_missing_values": "0"
      },
      {
        "data_type": "string",
        "index": "8",
        "is_ignore": "false",
        "is_row_identifier": "false",
        "is_target": "false",
        "name": "FIO2",
        "number_of_missing_values": "0"
      },
      {
        "data_type": "string",
        "index": "9",
        "is_ignore": "false",
        "is_row_identifier": "false",
        "is_target": "false",
        "name": "BP",
        "number_of_missing_values": "0"
      },
      {
        "data_type": "string",
        "index": "10",
        "is_ignore": "false",
        "is_row_identifier": "false",
        "is_target": "false",
        "name": "VENTMACH",
        "number_of_missing_values": "0"
      },
      {
        "data_type": "string",
        "index": "11",
        "is_ignore": "false",
        "is_row_identifier": "false",
        "is_target": "false",
        "name": "VENTTUBE",
        "number_of_missing_values": "0"
      },
      {
        "data_type": "string",
        "index": "12",
        "is_ignore": "false",
        "is_row_identifier": "false",
        "is_target": "false",
        "name": "CATECHOL",
        "number_of_missing_values": "0"
      },
      {
        "data_type": "string",
        "index": "13",
        "is_ignore": "false",
        "is_row_identifier": "false",
        "is_target": "false",
        "name": "CO",
        "number_of_missing_values": "0"
      },
      {
        "data_type": "string",
        "index": "14",
        "is_ignore": "false",
        "is_row_identifier": "false",
        "is_target": "false",
        "name": "INTUBATION",
        "number_of_missing_values": "0"
      },
      {
        "data_type": "nominal",
        "index": "15",
        "is_ignore": "false",
        "is_row_identifier": "false",
        "is_target": "false",
        "name": "ERRLOWOUTPUT",
        "nominal_value": [
          "True",
          "False"
        ],
        "number_of_missing_values": "0"
      },
      {
        "data_type": "string",
        "index": "16",
        "is_ignore": "false",
        "is_row_identifier": "false",
        "is_target": "false",
        "name": "PCWP",
        "number_of_missing_values": "0"
      },
      {
        "data_type": "string",
        "index": "17",
        "is_ignore": "false",
        "is_row_identifier": "false",
        "is_target": "false",
        "name": "MINVOLSET",
        "number_of_missing_values": "0"
      },
      {
        "data_type": "string",
        "index": "18",
        "is_ignore": "false",
        "is_row_identifier": "false",
        "is_target": "false",
        "name": "TPR",
        "number_of_missing_values": "0"
      },
      {
        "data_type": "string",
        "index": "19",
        "is_ignore": "false",
        "is_row_identifier": "false",
        "is_target": "false",
        "name": "CVP",
        "number_of_missing_values": "0"
      },
      {
        "data_type": "string",
        "index": "20",
        "is_ignore": "false",
        "is_row_identifier": "false",
        "is_target": "false",
        "name": "VENTLUNG",
        "number_of_missing_values": "0"
      },
      {
        "data_type": "nominal",
        "index": "21",
        "is_ignore": "false",
        "is_row_identifier": "false",
        "is_target": "false",
        "name": "ANAPHYLAXIS",
        "nominal_value": [
          "True",
          "False"
        ],
        "number_of_missing_values": "0"
      },
      {
        "data_type": "string",
        "index": "22",
        "is_ignore": "false",
        "is_row_identifier": "false",
        "is_target": "false",
        "name": "PVSAT",
        "number_of_missing_values": "0"
      },
      {
        "data_type": "string",
        "index": "23",
        "is_ignore": "false",
        "is_row_identifier": "false",
        "is_target": "false",
        "name": "MINVOL",
        "number_of_missing_values": "0"
      },
      {
        "data_type": "string",
        "index": "24",
        "is_ignore": "false",
        "is_row_identifier": "false",
        "is_target": "false",
        "name": "EXPCO2",
        "number_of_missing_values": "0"
      },
      {
        "data_type": "string",
        "index": "25",
        "is_ignore": "false",
        "is_row_identifier": "false",
        "is_target": "false",
        "name": "HRSAT",
        "number_of_missing_values": "0"
      },
      {
        "data_type": "nominal",
        "index": "26",
        "is_ignore": "false",
        "is_row_identifier": "false",
        "is_target": "false",
        "name": "LVFAILURE",
        "nominal_value": [
          "True",
          "False"
        ],
        "number_of_missing_values": "0"
      },
      {
        "data_type": "nominal",
        "index": "27",
        "is_ignore": "false",
        "is_row_identifier": "false",
        "is_target": "false",
        "name": "HYPOVOLEMIA",
        "nominal_value": [
          "True",
          "False"
        ],
        "number_of_missing_values": "0"
      },
      {
        "data_type": "string",
        "index": "28",
        "is_ignore": "false",
        "is_row_identifier": "false",
        "is_target": "false",
        "name": "HREKG",
        "number_of_missing_values": "0"
      },
      {
        "data_type": "string",
        "index": "29",
        "is_ignore": "false",
        "is_row_identifier": "false",
        "is_target": "false",
        "name": "LVEDVOLUME",
        "number_of_missing_values": "0"
      },
      {
        "data_type": "string",
        "index": "30",
        "is_ignore": "false",
        "is_row_identifier": "false",
        "is_target": "false",
        "name": "SAO2",
        "number_of_missing_values": "0"
      },
      {
        "data_type": "nominal",
        "index": "31",
        "is_ignore": "false",
        "is_row_identifier": "false",
        "is_target": "false",
        "name": "PULMEMBOLUS",
        "nominal_value": [
          "True",
          "False"
        ],
        "number_of_missing_values": "0"
      },
      {
        "data_type": "string",
        "index": "32",
        "is_ignore": "false",
        "is_row_identifier": "false",
        "is_target": "false",
        "name": "HR",
        "number_of_missing_values": "0"
      },
      {
        "data_type": "string",
        "index": "33",
        "is_ignore": "false",
        "is_row_identifier": "false",
        "is_target": "false",
        "name": "VENTALV",
        "number_of_missing_values": "0"
      },
      {
        "data_type": "string",
        "index": "34",
        "is_ignore": "false",
        "is_row_identifier": "false",
        "is_target": "false",
        "name": "STROKEVOLUME",
        "number_of_missing_values": "0"
      },
      {
        "data_type": "nominal",
        "index": "35",
        "is_ignore": "false",
        "is_row_identifier": "false",
        "is_target": "false",
        "name": "KINKEDTUBE",
        "nominal_value": [
          "True",
          "False"
        ],
        "number_of_missing_values": "0"
      },
      {
        "data_type": "string",
        "index": "36",
        "is_ignore": "false",
        "is_row_identifier": "false",
        "is_target": "false",
        "name": "SHUNT",
        "number_of_missing_values": "0"
      }
    ]
  }
}