{
  "data_set_description": {
    "collection_date": "30-09-2022",
    "creator": "Ihsan Ullah",
    "default_target_attribute": "CATEGORY",
    "description": "A copy of PLK_Mini dataset from Meta album Set0",
    "description_version": "1",
    "file_id": "22115004",
    "format": "arff",
    "id": "45104",
    "language": "English",
    "licence": "CC BY-NC 4.0",
    "md5_checksum": "e516631817c8be5c11de329527126a1c",
    "minio_url": "https://data.openml.org/datasets/0004/45104/dataset_45104.pq",
    "name": "PLK_Mini_Copy",
    "parquet_url": "https://data.openml.org/datasets/0004/45104/dataset_45104.pq",
    "processing_date": "2023-03-30 16:53:03",
    "status": "active",
    "upload_date": "2023-03-30T16:52:23",
    "url": "https://api.openml.org/data/v1/download/22115004/PLK_Mini_Copy.arff",
    "version": "1",
    "visibility": "public"
  }
}