{
  "data_qualities": {
    "quality": [
      {
        "name": "AutoCorrelation",
        "value": "1.0"
      },
      {
        "name": "Dimensionality",
        "value": "123.53921568627452"
      },
      {
        "name": "MajorityClassPercentage",
        "value": "50.98039215686274"
      },
      {
        "name": "MajorityClassSize",
        "value": "52.0"
      },
      {
        "name": "MinorityClassPercentage",
        "value": "49.01960784313725"
      },
      {
        "name": "MinorityClassSize",
        "value": "50.0"
      },
      {
        "name": "NumberOfBinaryFeatures",
        "value": "0.0"
      },
      {
        "name": "NumberOfClasses",
        "value": "2.0"
      },
      {
        "name": "NumberOfFeatures",
        "value": "12601.0"
      },
      {
        "name": "NumberOfInstances",
        "value": "102.0"
      },
      {
        "name": "NumberOfInstancesWithMissingValues",
        "value": "0.0"
      },
      {
        "name": "NumberOfMissingValues",
        "value": "0.0"
      },
      {
        "name": "NumberOfNumericFeatures",
        "value": "12600.0"
      },
      {
        "name": "NumberOfSymbolicFeatures",
        "value": "0.0"
      },
      {
        "name": "PercentageOfBinaryFeatures",
        "value": "0.0"
      },
      {
        "name": "PercentageOfInstancesWithMissingValues",
        "value": "0.0"
      },
      {
        "name": "PercentageOfMissingValues",
        "value": "0.0"
      },
      {
        "name": "PercentageOfNumericFeatures",
        "value": "99.99206412189508"
      },
      {
        "name": "PercentageOfSymbolicFeatures",
        "value": "0.0"
      }
    ]
  }
}