{
  "data_set_description": {
    "citation": "Yoontae Hwang, Youngbin Lee, Yongjae Lee,Semi-Supervised Learning for Tabular Datasets with Continuous and Categorical Variables, Archive, 2023",
    "collection_date": "01-27-2023",
    "creator": "Yoontae Hwang, Youngbin Lee, Yongjae Lee",
    "default_target_attribute": "class",
    "description": "This data set consists of three types of entities: (a) the specification of an auto in terms of various characteristics, (b) its assigned insurance risk rating, (c) its normalized losses in use as compared to other cars. The second rating corresponds to the degree to which the auto is more risky than its price indicates. Cars are initially assigned a risk factor symbol associated with its price. Then, if it is more risky (or less), this symbol is adjusted by moving it up (or down) the scale. Actuarians call this process \"symboling\". A value of +3 indicates that the auto is risky, -3 that it is probably pretty safe.The third factor is the relative average loss payment per insured vehicle year. This value is normalized for all autos within a particular size classification (two-door small, station wagons, sports/speciality, etc), and represents the average loss per car per year.Note: Several of the attributes in the database could be used as a \"class\" attribute.Source: https://www.kaggle.com/datasets/toramky/automobile-dataset",
    "description_version": "1",
    "file_id": "22112038",
    "format": "arff",
    "id": "45080",
    "language": "English",
    "licence": "Public",
    "md5_checksum": "56ce92fdb244a005a70b6c79d31d3ad9",
    "minio_url": "https://data.openml.org/datasets/0004/45080/dataset_45080.pq",
    "name": "autos",
    "parquet_url": "https://data.openml.org/datasets/0004/45080/dataset_45080.pq",
    "processing_date": "2023-01-27 11:55:05",
    "status": "active",
    "upload_date": "2023-01-27T11:53:48",
    "url": "https://api.openml.org/data/v1/download/22112038/autos.arff",
    "version": "3",
    "version_label": "1",
    "visibility": "public"
  }
}