{
  "data_set_description": {
    "citation": "Yoontae Hwang, Youngbin Lee, Yongjae Lee,Semi-Supervised Learning for Tabular Datasets with Continuous and Categorical Variables, Archive, 2023",
    "collection_date": "01-27-2023",
    "creator": [
      "Yoontae Hwang",
      "Youngbin Lee",
      "Yongjae Lee"
    ],
    "default_target_attribute": "class",
    "description": "The QSAR biodegradation dataset was built in the Milano Chemometrics and QSAR Research Group. The research leading to these results has received funding from the European Communitys Seventh Framework Programme [FP7/2007-2013] under Grant Agreement n. 238701 of Marie Curie ITN Environmental Chemoinformatics (ECO) project.The data have been used to develop QSAR (Quantitative Structure Activity Relationships) models for the study of the relationships between chemical structure and biodegradation of molecules. Biodegradation experimental values of 1055 chemicals were collected from the webpage of the National Institute of Technology and Evaluation of Japan (NITE). Classification models were developed in order to discriminate ready (356) and not ready (699) biodegradable molecules by means of three different modelling methods: k Nearest Neighbours, Partial Least Squares Discriminant Analysis and Support Vector Machines. Details on attributes (molecular descriptors) selected in each model can be found in the quoted reference: Mansouri, K., Ringsted, T., Ballabio, D., Todeschini, R., Consonni, V. (2013). Quantitative Structure - Activity Relationship models for ready biodegradability of chemicals. Journal of Chemical Information and Modeling, 53, 867-878.Source: https://archive.ics.uci.edu/ml/datasets/QSAR+biodegradation",
    "description_version": "2",
    "file_id": "22112035",
    "format": "arff",
    "id": "45077",
    "language": "English",
    "licence": "Public",
    "md5_checksum": "0f0bef2ef42fe1105b0edfa75e4c2a92",
    "minio_url": "https://data.openml.org/datasets/0004/45077/dataset_45077.pq",
    "name": "qsar",
    "parquet_url": "https://data.openml.org/datasets/0004/45077/dataset_45077.pq",
    "processing_date": "2023-01-27 11:45:02",
    "status": "active",
    "upload_date": "2023-01-27T11:44:22",
    "url": "https://api.openml.org/data/v1/download/22112035/qsar.arff",
    "version": "1",
    "version_label": "1",
    "visibility": "public"
  }
}